{"text_format":"1","workbook":"xlsx","n_sheets":36,"sheets":["Start","Home Page","Obj1","ene","feb","mar","abr","EOT1","Obj2","may","jun","jul","EOT2","Obj3","sep","oct","nov","dic","EOT3","EOT1 Asis","EOT2 Asis ","EOT3 Asis","Calculations","eneF","febF","marF","abrF","mayF","junF","julF","sepF","octF","novF","dicF","Calendar","Sheet2"],"not_rendered":{"charts":0,"images":30,"macros":1,"external_links":1,"defined_names":4,"comments":0,"pivot_tables":0},"unopened":[],"bounds":{"document_bytes":16777216,"sheet_cells":100000,"rows_first":2000,"rows_last":500,"rows_between":2000,"halvings":0,"cell_chars":16384,"cell_head_chars":4096},"cells_cut":0,"cells_raw":0,"read":"whole","date_system":"1900"}

{"sheet":"Start","index":0,"n_rows":17,"n_cols":3,"rows_kept":17,"cut":false,"hidden":false,"merged":[]}
[]
[]
[]
[]
[]
[]
[]
[]
[]
[]
[]
[]
[]
[]
[null,null,"First Step - Enable macros!"]
[]
[null,null,"Primer paso - Habilitar macros!"]

{"sheet":"Home Page","index":1,"n_rows":23,"n_cols":11,"rows_kept":23,"cut":false,"hidden":true,"merged":[[1,10,3,15],[1,7,3,8],[1,1,3,5]]}
[]
[null,"COMPLETE FOR EACH COURSE",null,null,null,null,null,"PRINT",null,null,"EDIT AND EMAIL MONTHLY"]
[]
[]
[]
[null,"Client","Rainbow Inc",null,"Teacher","Chris"]
[null,"Direccion","Toy street 1"]
[null,null,"Barcelona",null,"Students"]
[null,null,null,null,1,"Rod"]
[null,"Course","E1 - A1-1 Basico",null,2,"Jane"]
[null,null,null,null,3,"Freddy"]
[null,"Course",null,null,4,"George"]
[null,"Start","2019-01-08",null,5,"Bungle"]
[null,"End","2019-12-19",null,6,"Zippy"]
[null,null,null,null,7,"Mathew"]
[null,"Days","Day 1",null,8,"Sooty"]
[null,{"$f":"COUNT(E19:E28)","v":0},"Martes",null,9,"Sweep"]
[null,null,"Day 2",null,10,"Sue"]
[null,{"$f":"COUNT(F19:F28)","v":0},"Jueves"]
[]
[null,"Class "]
[null,"Start ","16:30:00"]
[null,"End","18:30:00"]

{"sheet":"Obj1","index":2,"n_rows":10,"n_cols":12,"rows_kept":10,"cut":false,"hidden":true,"merged":[[8,9,8,11],[8,0,8,2],[8,3,8,5],[8,6,8,8],[9,6,11,8],[9,9,11,11],[0,0,1,2],[0,7,1,9],[0,10,1,11],[2,0,2,2],[3,0,4,2],[3,9,4,11],[5,3,5,5],[5,6,5,8],[6,3,6,5],[6,6,6,8],[9,0,11,2],[9,3,11,5],[5,0,5,2],[6,0,6,2]]}
["Cliente",null,null,null,null,null,null,"Trimestre ",null,null,"ene - abr"]
[]
[{"$f":"+Calendar!A5","v":"Rainbow Inc"}]
["Dirección",null,null,null,null,null,null,null,null,"Horario"]
[]
[{"$f":"+Calendar!AI2","v":"Toy street 1"},null,null,"Grupo / nivel",null,null,"Profesor",null,null,"Dias",{"$f":"+Calendar!AI12","v":"Martes"},{"$f":"+Calendar!AI14","v":"Jueves"}]
[{"$f":"+Calendar!AI3","v":"Barcelona"},null,null,{"$f":"+Calendar!Q5","v":"E1 - A1-1 Basico"},null,null,{"$f":"+Calendar!AI21","v":"Chris"},null,null,"Hora",{"$f":"+Calendar!AI17","v":"16:30:00"},{"$f":"+Calendar!AI18","v":"18:30:00"}]
[]
["Objectivo Hablar",null,null,"Objectivo Escribir",null,null,"Objectivo Escuchar",null,null,"Objectivo Leer"]
[1,null,null,2,null,null,3,null,null,4]

{"sheet":"ene","index":3,"n_rows":78,"n_cols":12,"rows_kept":78,"cut":false,"hidden":true,"merged":[[5,0,5,2],[5,3,5,5],[5,6,5,8],[6,0,6,2],[6,3,6,5],[6,6,6,8],[0,0,1,2],[0,9,1,9],[0,10,1,11],[2,0,2,2],[3,0,4,2],[3,9,4,11],[10,7,11,11],[13,7,13,11],[8,4,9,6],[8,7,9,11],[12,7,12,11],[10,1,10,3],[11,1,11,3],[12,1,12,3],[10,4,10,6],[11,4,11,6],[8,1,9,3],[13,1,13,3],[15,4,16,6],[15,7,16,11],[17,1,17,3],[17,4,17,6],[17,7,18,11],[18,1,18,3],[18,4,18,6],[12,4,12,6],[13,4,13,6],[15,1,16,3],[19,4,19,6],[19,7,19,11],[20,1,20,3],[20,4,20,6],[20,7,20,11],[22,4,23,6],[22,7,23,11],[19,1,19,3],[22,1,23,3],[27,1,27,3],[27,4,27,6],[27,7,27,11],[29,4,30,6],[29,7,30,11],[29,1,30,3],[24,1,24,3],[24,4,24,6],[24,7,25,11],[25,1,25,3],[25,4,25,6],[26,1,26,3],[26,4,26,6],[26,7,26,11],[34,1,34,3],[34,4,34,6],[34,7,34,11],[36,4,37,6],[36,7,37,11],[36,1,37,3],[31,1,31,3],[31,4,31,6],[31,7,32,11],[32,1,32,3],[32,4,32,6],[33,1,33,3],[33,4,33,6],[33,7,33,11],[41,1,41,3],[41,4,41,6],[41,7,41,11],[43,4,44,6],[43,7,44,11],[43,1,44,3],[38,1,38,3],[38,4,38,6],[38,7,39,11],[39,1,39,3],[39,4,39,6],[40,1,40,3],[40,4,40,6],[40,7,40,11],[48,1,48,3],[48,4,48,6],[48,7,48,11],[50,4,51,6],[50,7,51,11],[50,1,51,3],[45,1,45,3],[45,4,45,6],[45,7,46,11],[46,1,46,3],[46,4,46,6],[47,1,47,3],[47,4,47,6],[47,7,47,11],[55,1,55,3],[55,4,55,6],[55,7,55,11],[58,4,59,6],[58,7,59,11],[58,1,59,3],[52,1,52,3],[52,4,52,6],[52,7,53,11],[53,1,53,3],[53,4,53,6],[54,1,54,3],[54,4,54,6],[54,7,54,11],[69,7,69,11],[63,1,63,3],[63,4,63,6],[63,7,63,11],[65,4,66,6],[65,7,66,11],[65,1,66,3],[60,1,60,3],[60,4,60,6],[60,7,61,11],[61,1,61,3],[61,4,61,6],[62,1,62,3],[62,4,62,6],[62,7,62,11],[70,1,70,3],[70,4,70,6],[70,7,70,11],[72,4,73,6],[72,7,73,11],[72,1,73,3],[67,1,67,3],[77,1,77,3],[77,4,77,6],[77,7,77,11],[74,1,74,3],[74,4,74,6],[74,7,75,11],[75,1,75,3],[75,4,75,6],[76,1,76,3],[76,4,76,6],[76,7,76,11],[67,4,67,6],[67,7,68,11],[68,1,68,3],[68,4,68,6],[69,1,69,3],[69,4,69,6]]}
["Cliente",null,null,null,null,null,null,null,null,"Mes",{"$f":"+Calendar!A8","v":"2019-01-01"}]
[]
[{"$f":"+Calendar!A5","v":"Rainbow Inc"}]
["Libros",null,null,null,null,null,null,null,null,"Horario"]
[]
[null,null,null,"Grupo / nivel",null,null,"Profesor",null,null,"Dias",{"$f":"+Calendar!AI12","v":"Martes"},{"$f":"+Calendar!AI14","v":"Jueves"}]
[null,null,null,{"$f":"+Calendar!Q5","v":"E1 - A1-1 Basico"},null,null,{"$f":"+Calendar!AI21","v":"Chris"},null,null,"Hora",{"$f":"+Calendar!AI17","v":"16:30:00"},{"$f":"+Calendar!AI18","v":"18:30:00"}]
[]
["Date","Material",null,null,"Content",null,null,"Aim"]
[{"$f":"+eneF!C9","v":"2019-01-08"}]
["Speaking"]
["Writing"]
["Listening",null,null,null,null,null,null,"Comments"]
["Reading"]
[]
["Date","Material",null,null,"Content",null,null,"Aim"]
[{"$f":"+eneF!D9","v":"2019-01-10"},"Coursebook"]
["Speaking"]
["Writing"]
["Listening",null,null,null,null,null,null,"Comments"]
["Reading"]
[]
["Date","Material",null,null,"Content",null,null,"Aim"]
[{"$f":"+eneF!E9","v":"2019-01-15"},"Coursebook"]
["Speaking"]
["Writing"]
["Listening",null,null,null,null,null,null,"Comments"]
["Reading"]
[]
["Date","Material",null,null,"Content",null,null,"Aim"]
[{"$f":"+eneF!F9","v":"2019-01-17"},"Coursebook"]
["Speaking"]
["Writing"]
["Listening",null,null,null,null,null,null,"Comments"]
["Reading"]
[]
["Date","Material",null,null,"Content",null,null,"Aim"]
[{"$f":"+eneF!G9","v":"2019-01-22"},"Coursebook"]
["Speaking"]
["Writing"]
["Listening",null,null,null,null,null,null,"Comments"]
["Reading"]
[]
["Date","Material",null,null,"Content",null,null,"Aim"]
[{"$f":"+eneF!H9","v":"2019-01-24"},"Coursebook"]
["Speaking"]
["Writing"]
["Listening",null,null,null,null,null,null,"Comments"]
["Reading"]
[]
["Date","Material",null,null,"Content",null,null,"Aim"]
[{"$f":"+eneF!I9","v":"2019-01-29"},"Coursebook"]
["Speaking"]
["Writing"]
["Listening",null,null,null,null,null,null,"Comments"]
["Reading"]
[]
[]
["Date","Material",null,null,"Content",null,null,"Aim"]
[{"$f":"+eneF!J9","v":"2019-01-31"},"Coursebook"]
["Speaking"]
["Writing"]
["Listening",null,null,null,null,null,null,"Comments"]
["Reading"]
[]
["Date","Material",null,null,"Content",null,null,"Aim"]
[{"$f":"+eneF!K9","v":""},"Coursebook"]
["Speaking"]
["Writing"]
["Listening",null,null,null,null,null,null,"Comments"]
["Reading"]
[]
["Date","Material",null,null,"Content",null,null,"Aim"]
[{"$f":"+eneF!L9","v":""},"Coursebook"]
["Speaking"]
["Writing"]
["Listening",null,null,null,null,null,null,"Comments"]
["Reading"]

{"sheet":"feb","index":4,"n_rows":64,"n_cols":12,"rows_kept":64,"cut":false,"hidden":true,"merged":[[5,0,5,2],[5,3,5,5],[5,6,5,8],[6,0,6,2],[6,3,6,5],[6,6,6,8],[0,0,1,2],[0,9,1,9],[0,10,1,11],[2,0,2,2],[3,0,4,2],[3,9,4,11],[12,1,12,3],[12,4,12,6],[12,7,12,11],[13,1,13,3],[13,4,13,6],[13,7,13,11],[8,1,9,3],[8,4,9,6],[8,7,9,11],[10,1,10,3],[10,4,10,6],[10,7,11,11],[11,1,11,3],[11,4,11,6],[19,1,19,3],[19,4,19,6],[19,7,19,11],[20,1,20,3],[20,4,20,6],[20,7,20,11],[15,1,16,3],[15,4,16,6],[15,7,16,11],[17,1,17,3],[17,4,17,6],[17,7,18,11],[18,1,18,3],[18,4,18,6],[26,1,26,3],[26,4,26,6],[26,7,26,11],[27,1,27,3],[27,4,27,6],[27,7,27,11],[22,1,23,3],[22,4,23,6],[22,7,23,11],[24,1,24,3],[24,4,24,6],[24,7,25,11],[25,1,25,3],[25,4,25,6],[33,1,33,3],[33,4,33,6],[33,7,33,11],[34,1,34,3],[34,4,34,6],[34,7,34,11],[29,1,30,3],[29,4,30,6],[29,7,30,11],[31,1,31,3],[31,4,31,6],[31,7,32,11],[32,1,32,3],[32,4,32,6],[40,1,40,3],[40,4,40,6],[40,7,40,11],[41,1,41,3],[41,4,41,6],[41,7,41,11],[36,1,37,3],[36,4,37,6],[36,7,37,11],[38,1,38,3],[38,4,38,6],[38,7,39,11],[39,1,39,3],[39,4,39,6],[47,1,47,3],[47,4,47,6],[47,7,47,11],[48,1,48,3],[48,4,48,6],[48,7,48,11],[43,4,44,6],[43,7,44,11],[45,1,45,3],[45,4,45,6],[45,7,46,11],[46,1,46,3],[46,4,46,6],[43,1,44,3],[54,1,54,3],[54,4,54,6],[54,7,54,11],[55,1,55,3],[55,4,55,6],[55,7,55,11],[50,1,51,3],[50,4,51,6],[50,7,51,11],[52,1,52,3],[52,4,52,6],[52,7,53,11],[53,1,53,3],[53,4,53,6],[62,1,62,3],[62,4,62,6],[62,7,62,11],[63,1,63,3],[63,4,63,6],[63,7,63,11],[58,1,59,3],[58,4,59,6],[58,7,59,11],[60,1,60,3],[60,4,60,6],[60,7,61,11],[61,1,61,3],[61,4,61,6]]}
["Cliente",null,null,null,null,null,null,null,null,"Mes",{"$f":"+febF!K1:L2","v":"2019-02-01"}]
[]
[{"$f":"+Calendar!A5","v":"Rainbow Inc"}]
["Libros",null,null,null,null,null,null,null,null,"Horario"]
[]
[null,null,null,"Grupo / nivel",null,null,"Profesor",null,null,"Dias",{"$f":"+Calendar!AI12","v":"Martes"},{"$f":"+Calendar!AI14","v":"Jueves"}]
[null,null,null,{"$f":"+Calendar!Q5","v":"E1 - A1-1 Basico"},null,null,{"$f":"+Calendar!AI21","v":"Chris"},null,null,"Hora",{"$f":"+Calendar!AI17","v":"16:30:00"},{"$f":"+Calendar!AI18","v":"18:30:00"}]
[]
["Date","Material",null,null,"Content",null,null,"Aim"]
[{"$f":"+febF!C9","v":"2019-02-05"}]
["Speaking"]
["Writing"]
["Listening",null,null,null,null,null,null,"Comments"]
["Reading"]
[]
["Date","Material",null,null,"Content",null,null,"Aim"]
[{"$f":"+febF!D9","v":"2019-02-07"},"Coursebook"]
["Speaking"]
["Writing"]
["Listening",null,null,null,null,null,null,"Comments"]
["Reading"]
[]
["Date","Material",null,null,"Content",null,null,"Aim"]
[{"$f":"+febF!E9","v":"2019-02-12"},"Coursebook"]
["Speaking"]
["Writing"]
["Listening",null,null,null,null,null,null,"Comments"]
["Reading"]
[]
["Date","Material",null,null,"Content",null,null,"Aim"]
[{"$f":"+febF!F9","v":"2019-02-14"},"Coursebook"]
["Speaking"]
["Writing"]
["Listening",null,null,null,null,null,null,"Comments"]
["Reading"]
[]
["Date","Material",null,null,"Content",null,null,"Aim"]
[{"$f":"+febF!G9","v":"2019-02-19"},"Coursebook"]
["Speaking"]
["Writing"]
["Listening",null,null,null,null,null,null,"Comments"]
["Reading"]
[]
["Date","Material",null,null,"Content",null,null,"Aim"]
[{"$f":"+febF!H9","v":"2019-02-21"},"Coursebook"]
["Speaking"]
["Writing"]
["Listening",null,null,null,null,null,null,"Comments"]
["Reading"]
[]
["Date","Material",null,null,"Content",null,null,"Aim"]
[{"$f":"+febF!I9","v":"2019-02-26"},"Coursebook"]
["Speaking"]
["Writing"]
["Listening",null,null,null,null,null,null,"Comments"]
["Reading"]
[]
[]
["Date","Material",null,null,"Content",null,null,"Aim"]
[{"$f":"+febF!J9","v":"2019-02-28"},"Coursebook"]
["Speaking"]
["Writing"]
["Listening",null,null,null,null,null,null,"Comments"]
["Reading"]

{"sheet":"mar","index":5,"n_rows":78,"n_cols":12,"rows_kept":78,"cut":false,"hidden":true,"merged":[[5,0,5,2],[5,3,5,5],[5,6,5,8],[6,0,6,2],[6,3,6,5],[6,6,6,8],[0,0,1,2],[0,9,1,9],[0,10,1,11],[2,0,2,2],[3,0,4,2],[3,9,4,11],[12,1,12,3],[12,4,12,6],[12,7,12,11],[13,1,13,3],[13,4,13,6],[13,7,13,11],[8,1,9,3],[8,4,9,6],[8,7,9,11],[10,1,10,3],[10,4,10,6],[10,7,11,11],[11,1,11,3],[11,4,11,6],[19,1,19,3],[19,4,19,6],[19,7,19,11],[20,1,20,3],[20,4,20,6],[20,7,20,11],[15,1,16,3],[15,4,16,6],[15,7,16,11],[17,1,17,3],[17,4,17,6],[17,7,18,11],[18,1,18,3],[18,4,18,6],[26,1,26,3],[26,4,26,6],[26,7,26,11],[27,1,27,3],[27,4,27,6],[27,7,27,11],[22,1,23,3],[22,4,23,6],[22,7,23,11],[24,1,24,3],[24,4,24,6],[24,7,25,11],[25,1,25,3],[25,4,25,6],[33,1,33,3],[33,4,33,6],[33,7,33,11],[34,1,34,3],[34,4,34,6],[34,7,34,11],[29,1,30,3],[29,4,30,6],[29,7,30,11],[31,1,31,3],[31,4,31,6],[31,7,32,11],[32,1,32,3],[32,4,32,6],[40,1,40,3],[40,4,40,6],[40,7,40,11],[41,1,41,3],[41,4,41,6],[41,7,41,11],[36,1,37,3],[36,4,37,6],[36,7,37,11],[38,1,38,3],[38,4,38,6],[38,7,39,11],[39,1,39,3],[39,4,39,6],[47,1,47,3],[47,4,47,6],[47,7,47,11],[48,1,48,3],[48,4,48,6],[48,7,48,11],[43,4,44,6],[43,7,44,11],[45,1,45,3],[45,4,45,6],[45,7,46,11],[46,1,46,3],[46,4,46,6],[43,1,44,3],[54,1,54,3],[54,4,54,6],[54,7,54,11],[55,1,55,3],[55,4,55,6],[55,7,55,11],[50,1,51,3],[50,4,51,6],[50,7,51,11],[52,1,52,3],[52,4,52,6],[52,7,53,11],[53,1,53,3],[53,4,53,6],[62,1,62,3],[62,4,62,6],[62,7,62,11],[63,1,63,3],[63,4,63,6],[63,7,63,11],[58,1,59,3],[58,4,59,6],[58,7,59,11],[60,1,60,3],[60,4,60,6],[60,7,61,11],[61,1,61,3],[61,4,61,6],[69,1,69,3],[69,4,69,6],[69,7,69,11],[70,1,70,3],[70,4,70,6],[70,7,70,11],[65,1,66,3],[65,4,66,6],[65,7,66,11],[67,1,67,3],[67,4,67,6],[67,7,68,11],[68,1,68,3],[68,4,68,6],[76,1,76,3],[76,4,76,6],[76,7,76,11],[77,1,77,3],[77,4,77,6],[77,7,77,11],[72,1,73,3],[72,4,73,6],[72,7,73,11],[74,1,74,3],[74,4,74,6],[74,7,75,11],[75,1,75,3],[75,4,75,6]]}
["Cliente",null,null,null,null,null,null,null,null,"Mes",{"$f":"+marF!K1:L2","v":"2019-03-01"}]
[]
[{"$f":"+Calendar!A5","v":"Rainbow Inc"}]
["Libros",null,null,null,null,null,null,null,null,"Horario"]
[]
[null,null,null,"Grupo / nivel",null,null,"Profesor",null,null,"Dias",{"$f":"+Calendar!AI12","v":"Martes"},{"$f":"+Calendar!AI14","v":"Jueves"}]
[null,null,null,{"$f":"+Calendar!Q5","v":"E1 - A1-1 Basico"},null,null,{"$f":"+Calendar!AI21","v":"Chris"},null,null,"Hora",{"$f":"+Calendar!AI17","v":"16:30:00"},{"$f":"+Calendar!AI18","v":"18:30:00"}]
[]
["Date","Material",null,null,"Content",null,null,"Aim"]
[{"$f":"+marF!C9","v":"2019-03-05"}]
["Speaking"]
["Writing"]
["Listening",null,null,null,null,null,null,"Comments"]
["Reading"]
[]
["Date","Material",null,null,"Content",null,null,"Aim"]
[{"$f":"+marF!D9","v":"2019-03-07"},"Coursebook"]
["Speaking"]
["Writing"]
["Listening",null,null,null,null,null,null,"Comments"]
["Reading"]
[]
["Date","Material",null,null,"Content",null,null,"Aim"]
[{"$f":"+marF!E9","v":"2019-03-12"},"Coursebook"]
["Speaking"]
["Writing"]
["Listening",null,null,null,null,null,null,"Comments"]
["Reading"]
[]
["Date","Material",null,null,"Content",null,null,"Aim"]
[{"$f":"+marF!F9","v":"2019-03-14"},"Coursebook"]
["Speaking"]
["Writing"]
["Listening",null,null,null,null,null,null,"Comments"]
["Reading"]
[]
["Date","Material",null,null,"Content",null,null,"Aim"]
[{"$f":"+marF!G9","v":"2019-03-19"},"Coursebook"]
["Speaking"]
["Writing"]
["Listening",null,null,null,null,null,null,"Comments"]
["Reading"]
[]
["Date","Material",null,null,"Content",null,null,"Aim"]
[{"$f":"+marF!H9","v":"2019-03-21"},"Coursebook"]
["Speaking"]
["Writing"]
["Listening",null,null,null,null,null,null,"Comments"]
["Reading"]
[]
["Date","Material",null,null,"Content",null,null,"Aim"]
[{"$f":"+marF!I9","v":"2019-03-26"},"Coursebook"]
["Speaking"]
["Writing"]
["Listening",null,null,null,null,null,null,"Comments"]
["Reading"]
[]
[]
["Date","Material",null,null,"Content",null,null,"Aim"]
[{"$f":"+marF!J9","v":"2019-03-28"},"Coursebook"]
["Speaking"]
["Writing"]
["Listening",null,null,null,null,null,null,"Comments"]
["Reading"]
[]
["Date","Material",null,null,"Content",null,null,"Aim"]
[{"$f":"+marF!K9","v":""},"Coursebook"]
["Speaking"]
["Writing"]
["Listening",null,null,null,null,null,null,"Comments"]
["Reading"]
[]
["Date","Material",null,null,"Content",null,null,"Aim"]
[{"$f":"+marF!L9","v":""},"Coursebook"]
["Speaking"]
["Writing"]
["Listening",null,null,null,null,null,null,"Comments"]
["Reading"]

{"sheet":"abr","index":6,"n_rows":78,"n_cols":12,"rows_kept":78,"cut":false,"hidden":true,"merged":[[5,0,5,2],[5,3,5,5],[5,6,5,8],[6,0,6,2],[6,3,6,5],[6,6,6,8],[0,0,1,2],[0,9,1,9],[0,10,1,11],[2,0,2,2],[3,0,4,2],[3,9,4,11],[12,1,12,3],[12,4,12,6],[12,7,12,11],[13,1,13,3],[13,4,13,6],[13,7,13,11],[8,1,9,3],[8,4,9,6],[8,7,9,11],[10,1,10,3],[10,4,10,6],[10,7,11,11],[11,1,11,3],[11,4,11,6],[19,1,19,3],[19,4,19,6],[19,7,19,11],[20,1,20,3],[20,4,20,6],[20,7,20,11],[15,1,16,3],[15,4,16,6],[15,7,16,11],[17,1,17,3],[17,4,17,6],[17,7,18,11],[18,1,18,3],[18,4,18,6],[26,1,26,3],[26,4,26,6],[26,7,26,11],[27,1,27,3],[27,4,27,6],[27,7,27,11],[22,1,23,3],[22,4,23,6],[22,7,23,11],[24,1,24,3],[24,4,24,6],[24,7,25,11],[25,1,25,3],[25,4,25,6],[33,1,33,3],[33,4,33,6],[33,7,33,11],[34,1,34,3],[34,4,34,6],[34,7,34,11],[29,1,30,3],[29,4,30,6],[29,7,30,11],[31,1,31,3],[31,4,31,6],[31,7,32,11],[32,1,32,3],[32,4,32,6],[40,1,40,3],[40,4,40,6],[40,7,40,11],[41,1,41,3],[41,4,41,6],[41,7,41,11],[36,1,37,3],[36,4,37,6],[36,7,37,11],[38,1,38,3],[38,4,38,6],[38,7,39,11],[39,1,39,3],[39,4,39,6],[47,1,47,3],[47,4,47,6],[47,7,47,11],[48,1,48,3],[48,4,48,6],[48,7,48,11],[43,4,44,6],[43,7,44,11],[45,1,45,3],[45,4,45,6],[45,7,46,11],[46,1,46,3],[46,4,46,6],[43,1,44,3],[54,1,54,3],[54,4,54,6],[54,7,54,11],[55,1,55,3],[55,4,55,6],[55,7,55,11],[50,1,51,3],[50,4,51,6],[50,7,51,11],[52,1,52,3],[52,4,52,6],[52,7,53,11],[53,1,53,3],[53,4,53,6],[62,1,62,3],[62,4,62,6],[62,7,62,11],[63,1,63,3],[63,4,63,6],[63,7,63,11],[58,1,59,3],[58,4,59,6],[58,7,59,11],[60,1,60,3],[60,4,60,6],[60,7,61,11],[61,1,61,3],[61,4,61,6],[69,1,69,3],[69,4,69,6],[69,7,69,11],[70,1,70,3],[70,4,70,6],[70,7,70,11],[65,1,66,3],[65,4,66,6],[65,7,66,11],[67,1,67,3],[67,4,67,6],[67,7,68,11],[68,1,68,3],[68,4,68,6],[76,1,76,3],[76,4,76,6],[76,7,76,11],[77,1,77,3],[77,4,77,6],[77,7,77,11],[72,1,73,3],[72,4,73,6],[72,7,73,11],[74,1,74,3],[74,4,74,6],[74,7,75,11],[75,1,75,3],[75,4,75,6]]}
["Cliente",null,null,null,null,null,null,null,null,"Mes",{"$f":"+abrF!K1","v":"2019-04-01"}]
[]
[{"$f":"+Calendar!A5","v":"Rainbow Inc"}]
["Libros",null,null,null,null,null,null,null,null,"Horario"]
[]
[null,null,null,"Grupo / nivel",null,null,"Profesor",null,null,"Dias",{"$f":"+Calendar!AI12","v":"Martes"},{"$f":"+Calendar!AI14","v":"Jueves"}]
[null,null,null,{"$f":"+Calendar!Q5","v":"E1 - A1-1 Basico"},null,null,{"$f":"+Calendar!AI21","v":"Chris"},null,null,"Hora",{"$f":"+Calendar!AI17","v":"16:30:00"},{"$f":"+Calendar!AI18","v":"18:30:00"}]
[]
["Date","Material",null,null,"Content",null,null,"Aim"]
[{"$f":"+abrF!C9","v":"2019-04-02"}]
["Speaking"]
["Writing"]
["Listening",null,null,null,null,null,null,"Comments"]
["Reading"]
[]
["Date","Material",null,null,"Content",null,null,"Aim"]
[{"$f":"+abrF!D9","v":"2019-04-04"},"Coursebook"]
["Speaking"]
["Writing"]
["Listening",null,null,null,null,null,null,"Comments"]
["Reading"]
[]
["Date","Material",null,null,"Content",null,null,"Aim"]
[{"$f":"+abrF!E9","v":"2019-04-09"},"Coursebook"]
["Speaking"]
["Writing"]
["Listening",null,null,null,null,null,null,"Comments"]
["Reading"]
[]
["Date","Material",null,null,"Content",null,null,"Aim"]
[{"$f":"+abrF!F9","v":"2019-04-11"},"Coursebook"]
["Speaking"]
["Writing"]
["Listening",null,null,null,null,null,null,"Comments"]
["Reading"]
[]
["Date","Material",null,null,"Content",null,null,"Aim"]
[{"$f":"+abrF!G9","v":"2019-04-16"},"Coursebook"]
["Speaking"]
["Writing"]
["Listening",null,null,null,null,null,null,"Comments"]
["Reading"]
[]
["Date","Material",null,null,"Content",null,null,"Aim"]
[{"$f":"+abrF!H9","v":"2019-04-18"},"Coursebook"]
["Speaking"]
["Writing"]
["Listening",null,null,null,null,null,null,"Comments"]
["Reading"]
[]
["Date","Material",null,null,"Content",null,null,"Aim"]
[{"$f":"+abrF!I9","v":"2019-04-23"},"Coursebook"]
["Speaking"]
["Writing"]
["Listening",null,null,null,null,null,null,"Comments"]
["Reading"]
[]
[]
["Date","Material",null,null,"Content",null,null,"Aim"]
[{"$f":"+abrF!J9","v":"2019-04-25"},"Coursebook"]
["Speaking"]
["Writing"]
["Listening",null,null,null,null,null,null,"Comments"]
["Reading"]
[]
["Date","Material",null,null,"Content",null,null,"Aim"]
[{"$f":"+abrF!K9","v":"2019-04-30"},"Coursebook"]
["Speaking"]
["Writing"]
["Listening",null,null,null,null,null,null,"Comments"]
["Reading"]
[]
["Date","Material",null,null,"Content",null,null,"Aim"]
[{"$f":"+abrF!L9","v":""},"Coursebook"]
["Speaking"]
["Writing"]
["Listening",null,null,null,null,null,null,"Comments"]
["Reading"]

{"sheet":"EOT1","index":7,"n_rows":319,"n_cols":12,"rows_kept":319,"cut":false,"hidden":true,"merged":[[0,0,1,2],[0,10,1,11],[2,0,2,2],[3,0,4,2],[3,9,4,11],[0,7,1,9],[5,3,5,5],[5,6,5,8],[6,3,6,5],[6,6,6,8],[5,0,6,2],[18,6,22,11],[17,6,17,11],[12,9,15,11],[12,6,15,8],[8,9,8,11],[10,2,10,3],[10,4,10,5],[10,6,10,8],[10,9,10,11],[8,0,8,2],[9,6,9,8],[9,9,9,11],[21,4,21,5],[22,4,22,5],[18,2,22,3],[8,3,8,5],[8,6,8,8],[18,4,18,5],[19,4,19,5],[20,4,20,5],[17,0,17,1],[17,2,17,5],[12,4,12,5],[13,4,13,5],[14,4,14,5],[15,4,15,5],[9,0,9,2],[9,3,9,5],[12,0,12,1],[13,0,13,1],[14,0,14,1],[15,0,15,1],[12,2,12,3],[13,2,13,3],[14,2,14,3],[15,2,15,3],[10,0,10,1],[37,0,38,2],[37,3,37,5],[37,6,37,8],[38,3,38,5],[38,6,38,8],[32,0,33,2],[32,7,33,9],[32,10,33,11],[34,0,34,2],[35,0,36,2],[35,9,36,11],[42,0,42,1],[42,2,42,3],[42,4,42,5],[42,6,42,8],[42,9,42,11],[40,0,40,2],[40,3,40,5],[40,6,40,8],[40,9,40,11],[41,0,41,2],[41,3,41,5],[41,6,41,8],[41,9,41,11],[44,0,44,1],[44,2,44,3],[44,4,44,5],[44,6,47,8],[44,9,47,11],[45,0,45,1],[45,2,45,3],[45,4,45,5],[46,0,46,1],[46,2,46,3],[46,4,46,5],[47,0,47,1],[47,2,47,3],[47,4,47,5],[49,0,49,1],[49,2,49,5],[49,6,49,11],[50,2,54,3],[50,4,50,5],[50,6,54,11],[51,4,51,5],[52,4,52,5],[53,4,53,5],[54,4,54,5],[68,0,69,2],[68,9,69,11],[70,0,71,2],[70,3,70,5],[70,6,70,8],[71,3,71,5],[71,6,71,8],[65,0,66,2],[65,7,66,9],[65,10,66,11],[67,0,67,2],[75,0,75,1],[75,2,75,3],[75,4,75,5],[75,6,75,8],[75,9,75,11],[73,0,73,2],[73,3,73,5],[73,6,73,8],[73,9,73,11],[74,0,74,2],[74,3,74,5],[74,6,74,8],[74,9,74,11],[77,0,77,1],[77,2,77,3],[77,4,77,5],[77,6,80,8],[77,9,80,11],[78,0,78,1],[78,2,78,3],[78,4,78,5],[79,0,79,1],[79,2,79,3],[79,4,79,5],[80,0,80,1],[80,2,80,3],[80,4,80,5],[82,0,82,1],[82,2,82,5],[82,6,82,11],[83,2,87,3],[83,4,83,5],[83,6,87,11],[84,4,84,5],[85,4,85,5],[86,4,86,5],[87,4,87,5],[103,0,104,2],[103,3,103,5],[103,6,103,8],[104,3,104,5],[104,6,104,8],[98,0,99,2],[98,7,99,9],[98,10,99,11],[100,0,100,2],[101,0,102,2],[101,9,102,11],[108,0,108,1],[108,2,108,3],[108,4,108,5],[108,6,108,8],[108,9,108,11],[106,0,106,2],[106,3,106,5],[106,6,106,8],[106,9,106,11],[107,0,107,2],[107,3,107,5],[107,6,107,8],[107,9,107,11],[110,0,110,1],[110,2,110,3],[110,4,110,5],[110,6,113,8],[110,9,113,11],[111,0,111,1],[111,2,111,3],[111,4,111,5],[112,0,112,1],[112,2,112,3],[112,4,112,5],[113,0,113,1],[113,2,113,3],[113,4,113,5],[115,0,115,1],[115,2,115,5],[115,6,115,11],[116,2,120,3],[116,4,116,5],[116,6,120,11],[117,4,117,5],[118,4,118,5],[119,4,119,5],[120,4,120,5],[136,0,137,2],[136,3,136,5],[136,6,136,8],[137,3,137,5],[137,6,137,8],[131,0,132,2],[131,7,132,9],[131,10,132,11],[133,0,133,2],[134,0,135,2],[134,9,135,11],[141,0,141,1],[141,2,141,3],[141,4,141,5],[141,6,141,8],[141,9,141,11],[139,0,139,2],[139,3,139,5],[139,6,139,8],[139,9,139,11],[140,0,140,2],[140,3,140,5],[140,6,140,8],[140,9,140,11],[143,0,143,1],[143,2,143,3],[143,4,143,5],[143,6,146,8],[143,9,146,11],[144,0,144,1],[144,2,144,3],[144,4,144,5],[145,0,145,1],[145,2,145,3],[145,4,145,5],[146,0,146,1],[146,2,146,3],[146,4,146,5],[148,0,148,1],[148,2,148,5],[148,6,148,11],[149,2,153,3],[149,4,149,5],[149,6,153,11],[150,4,150,5],[151,4,151,5],[152,4,152,5],[153,4,153,5],[169,0,170,2],[169,3,169,5],[169,6,169,8],[170,3,170,5],[170,6,170,8],[164,0,165,2],[164,7,165,9],[164,10,165,11],[166,0,166,2],[167,0,168,2],[167,9,168,11],[174,0,174,1],[174,2,174,3],[174,4,174,5],[174,6,174,8],[174,9,174,11],[172,0,172,2],[172,3,172,5],[172,6,172,8],[172,9,172,11],[173,0,173,2],[173,3,173,5],[173,6,173,8],[173,9,173,11],[176,0,176,1],[176,2,176,3],[176,4,176,5],[176,6,179,8],[176,9,179,11],[177,0,177,1],[177,2,177,3],[177,4,177,5],[178,0,178,1],[178,2,178,3],[178,4,178,5],[179,0,179,1],[179,2,179,3],[179,4,179,5],[181,0,181,1],[181,2,181,5],[181,6,181,11],[182,2,186,3],[182,4,182,5],[182,6,186,11],[183,4,183,5],[184,4,184,5],[185,4,185,5],[186,4,186,5],[202,0,203,2],[202,3,202,5],[202,6,202,8],[203,3,203,5],[203,6,203,8],[197,0,198,2],[197,7,198,9],[197,10,198,11],[199,0,199,2],[200,0,201,2],[200,9,201,11],[207,0,207,1],[207,2,207,3],[207,4,207,5],[207,6,207,8],[207,9,207,11],[205,0,205,2],[205,3,205,5],[205,6,205,8],[205,9,205,11],[206,0,206,2],[206,3,206,5],[206,6,206,8],[206,9,206,11],[209,0,209,1],[209,2,209,3],[209,4,209,5],[209,6,212,8],[209,9,212,11],[210,0,210,1],[210,2,210,3],[210,4,210,5],[211,0,211,1],[211,2,211,3],[211,4,211,5],[212,0,212,1],[212,2,212,3],[212,4,212,5],[214,0,214,1],[214,2,214,5],[214,6,214,11],[215,2,219,3],[215,4,215,5],[215,6,219,11],[216,4,216,5],[217,4,217,5],[218,4,218,5],[219,4,219,5],[235,0,236,2],[235,3,235,5],[235,6,235,8],[236,3,236,5],[236,6,236,8],[230,0,231,2],[230,7,231,9],[230,10,231,11],[232,0,232,2],[233,0,234,2],[233,9,234,11],[240,0,240,1],[240,2,240,3],[240,4,240,5],[240,6,240,8],[240,9,240,11],[238,0,238,2],[238,3,238,5],[238,6,238,8],[238,9,238,11],[239,0,239,2],[239,3,239,5],[239,6,239,8],[239,9,239,11],[242,0,242,1],[242,2,242,3],[242,4,242,5],[242,6,245,8],[242,9,245,11],[243,0,243,1],[243,2,243,3],[243,4,243,5],[244,0,244,1],[244,2,244,3],[244,4,244,5],[245,0,245,1],[245,2,245,3],[245,4,245,5],[247,0,247,1],[247,2,247,5],[247,6,247,11],[248,2,252,3],[248,4,248,5],[248,6,252,11],[249,4,249,5],[250,4,250,5],[251,4,251,5],[252,4,252,5],[268,0,269,2],[268,3,268,5],[268,6,268,8],[269,3,269,5],[269,6,269,8],[263,0,264,2],[263,7,264,9],[263,10,264,11],[265,0,265,2],[266,0,267,2],[266,9,267,11],[273,0,273,1],[273,2,273,3],[273,4,273,5],[273,6,273,8],[273,9,273,11],[271,0,271,2],[271,3,271,5],[271,6,271,8],[271,9,271,11],[272,0,272,2],[272,3,272,5],[272,6,272,8],[272,9,272,11],[275,0,275,1],[275,2,275,3],[275,4,275,5],[275,6,278,8],[275,9,278,11],[276,0,276,1],[276,2,276,3],[276,4,276,5],[277,0,277,1],[277,2,277,3],[277,4,277,5],[278,0,278,1],[278,2,278,3],[278,4,278,5],[280,0,280,1],[280,2,280,5],[280,6,280,11],[281,2,285,3],[281,4,281,5],[281,6,285,11],[282,4,282,5],[283,4,283,5],[284,4,284,5],[285,4,285,5],[301,0,302,2],[301,3,301,5],[301,6,301,8],[302,3,302,5],[302,6,302,8],[296,0,297,2],[296,7,297,9],[296,10,297,11],[298,0,298,2],[299,0,300,2],[299,9,300,11],[306,0,306,1],[306,2,306,3],[306,4,306,5],[306,6,306,8],[306,9,306,11],[304,0,304,2],[304,3,304,5],[304,6,304,8],[304,9,304,11],[305,0,305,2],[305,3,305,5],[305,6,305,8],[305,9,305,11],[308,0,308,1],[308,2,308,3],[308,4,308,5],[308,6,311,8],[308,9,311,11],[309,0,309,1],[309,2,309,3],[309,4,309,5],[310,0,310,1],[310,2,310,3],[310,4,310,5],[311,0,311,1],[311,2,311,3],[311,4,311,5],[313,0,313,1],[313,2,313,5],[313,6,313,11],[314,2,318,3],[314,4,314,5],[314,6,318,11],[315,4,315,5],[316,4,316,5],[317,4,317,5],[318,4,318,5]]}
["Cliente",null,null,null,null,null,null,"Informe trimestral",null,null,{"$f":"+'Obj1'!K1:L2","v":"ene - abr"}]
[]
[{"$f":"+Calendar!A5","v":"Rainbow Inc"}]
["Estudiante",null,null,null,null,null,null,null,null,"Horario"]
[]
[{"$f":"+Calendar!B42","v":"Rod"},null,null,"Grupo / nivel",null,null,"Profesor",null,null,"Dias",{"$f":"+Calendar!AI12","v":"Martes"},{"$f":"+Calendar!AI14","v":"Jueves"}]
[null,null,null,{"$f":"+Calendar!Q5","v":"E1 - A1-1 Basico"},null,null,{"$f":"+Calendar!AI21","v":"Chris"},null,null,"Hora",{"$f":"+Calendar!AI17","v":"16:30:00"},{"$f":"+Calendar!AI18","v":"18:30:00"}]
[]
["Objectivo Hablar",null,null,"Objectivo Escribir",null,null,"Objectivo Escuchar",null,null,"Objectivo Leer"]
[{"$f":"+'Obj1'!A10","v":1},null,null,{"$f":"+'Obj1'!D10","v":2},null,null,{"$f":"+'Obj1'!G10","v":3},null,null,{"$f":"+'Obj1'!J10","v":4}]
["Capacidades",null,"Puntuación %",null,"Objetivos alcanzados",null,"Puntos Fuertes",null,null,"Puntos Debíles"]
[]
["Hablar",null,0.9,null,"Si o No",null,"•\n•\n•",null,null,"•\n•\n•"]
["Escribir",null,0.1,null,"Si o No"]
["Escuchar",null,0.9,null,"Si o No"]
["Leer",null,0.8,null,"Si o No"]
[]
["Asistencia",null,null,null,null,null,"Comentarios"]
[{"$f":"+eneF!$K$1","v":"2019-01-01"},{"$f":"+'EOT1 Asis'!C41","v":0},{"$f":"SUM(C13:D16)/4","v":0.67500000000000004},null,"Excelente"]
[{"$f":"febF!$K$1","v":"2019-02-01"},{"$f":"+'EOT1 Asis'!C42","v":0},null,null,"Muy Bueno"]
[{"$f":"marF!$K$1","v":"2019-03-01"},{"$f":"+'EOT1 Asis'!C43","v":0},null,null,"Bueno"]
[{"$f":"abrF!$K$1","v":"2019-04-01"},{"$f":"+'EOT1 Asis'!C44","v":0},null,null,"Satisfactaria"]
["Total",{"$f":"+'EOT1 Asis'!L12","v":0}]
[]
[]
[]
[]
[]
[]
[]
[]
[]
["Cliente",null,null,null,null,null,null,"Informe trimestral",null,null,{"$f":"+$K$1","v":"ene - abr"}]
[]
[{"$f":"+$A$3","v":"Rainbow Inc"}]
["Estudiante",null,null,null,null,null,null,null,null,"Horario"]
[]
[{"$f":"+Calendar!B43","v":"Jane"},null,null,"Grupo / nivel",null,null,"Profesor",null,null,"Dias",{"$f":"+$K$6","v":"Martes"},{"$f":"+$L$6","v":"Jueves"}]
[null,null,null,{"$f":"+$D$7","v":"E1 - A1-1 Basico"},null,null,{"$f":"+$G$7","v":"Chris"},null,null,"Hora",{"$f":"+$K$7","v":"16:30:00"},{"$f":"+$L$7","v":"18:30:00"}]
[]
["Objectivo Hablar",null,null,"Objectivo Escribir",null,null,"Objectivo Escuchar",null,null,"Objectivo Leer"]
[{"$f":"+$A$10","v":1},null,null,{"$f":"+$D$10","v":2},null,null,{"$f":"+$G$10","v":3},null,null,{"$f":"+$J$10","v":4}]
["Capacidades",null,"Puntuación %",null,"Objetivos alcanzados",null,"Puntos Fuertes",null,null,"Puntos Debíles"]
[]
["Hablar",null,0.2,null,"Si o No",null,"•\n•\n•",null,null,"•\n•\n•"]
["Escribir",null,0.7,null,"Si o No"]
["Escuchar",null,0.7,null,"Si o No"]
["Leer",null,0.8,null,"Si o No"]
[]
["Asistencia",null,null,null,null,null,"Comentarios"]
[{"$f":"+$A$19","v":"2019-01-01"},{"$f":"+'EOT1 Asis'!D41","v":0},{"$f":"SUM(C45:D48)/4","v":0.6},null,"Excelente"]
[{"$f":"+$A$20","v":"2019-02-01"},{"$f":"+'EOT1 Asis'!D42","v":0},null,null,"Muy Bueno"]
[{"$f":"+$A$21","v":"2019-03-01"},{"$f":"+'EOT1 Asis'!D43","v":0},null,null,"Bueno"]
[{"$f":"+$A$22","v":"2019-04-01"},{"$f":"+'EOT1 Asis'!D44","v":0},null,null,"Satisfactaria"]
["Total",{"$f":"+'EOT1 Asis'!L13","v":0}]
[]
[]
[]
[]
[]
[]
[]
[]
[]
[]
["Cliente",null,null,null,null,null,null,"Informe trimestral",null,null,{"$f":"+$K$1","v":"ene - abr"}]
[]
[{"$f":"+$A$3","v":"Rainbow Inc"}]
["Estudiante",null,null,null,null,null,null,null,null,"Horario"]
[]
[{"$f":"+Calendar!B44","v":"Freddy"},null,null,"Grupo / nivel",null,null,"Profesor",null,null,"Dias",{"$f":"+$K$6","v":"Martes"},{"$f":"+$L$6","v":"Jueves"}]
[null,null,null,{"$f":"+$D$7","v":"E1 - A1-1 Basico"},null,null,{"$f":"+$G$7","v":"Chris"},null,null,"Hora",{"$f":"+$K$7","v":"16:30:00"},{"$f":"+$L$7","v":"18:30:00"}]
[]
["Objectivo Hablar",null,null,"Objectivo Escribir",null,null,"Objectivo Escuchar",null,null,"Objectivo Leer"]
[{"$f":"+$A$10","v":1},null,null,{"$f":"+$D$10","v":2},null,null,{"$f":"+$G$10","v":3},null,null,{"$f":"+$J$10","v":4}]
["Capacidades",null,"Puntuación %",null,"Objetivos alcanzados",null,"Puntos Fuertes",null,null,"Puntos Debíles"]
[]
["Hablar",null,0.9,null,"Si o No",null,"•\n•\n•",null,null,"•\n•\n•"]
["Escribir",null,0.1,null,"Si o No"]
["Escuchar",null,0.9,null,"Si o No"]
["Leer",null,0.8,null,"Si o No"]
[]
["Asistencia",null,null,null,null,null,"Comentarios"]
[{"$f":"+$A$19","v":"2019-01-01"},{"$f":"+'EOT1 Asis'!E41","v":0},{"$f":"SUM(C78:D81)/4","v":0.67500000000000004},null,"Excelente"]
[{"$f":"+$A$20","v":"2019-02-01"},{"$f":"+'EOT1 Asis'!E42","v":0},null,null,"Muy Bueno"]
[{"$f":"+$A$21","v":"2019-03-01"},{"$f":"+'EOT1 Asis'!E43","v":0},null,null,"Bueno"]
[{"$f":"+$A$22","v":"2019-04-01"},{"$f":"+'EOT1 Asis'!E44","v":0},null,null,"Satisfactaria"]
["Total",{"$f":"+'EOT1 Asis'!L14","v":0}]
[]
[]
[]
[]
[]
[]
[]
[]
[]
[]
["Cliente",null,null,null,null,null,null,"Informe trimestral",null,null,{"$f":"+$K$1","v":"ene - abr"}]
[]
[{"$f":"+$A$3","v":"Rainbow Inc"}]
["Estudiante",null,null,null,null,null,null,null,null,"Horario"]
[]
[{"$f":"+Calendar!B45","v":"George"},null,null,"Grupo / nivel",null,null,"Profesor",null,null,"Dias",{"$f":"+$K$6","v":"Martes"},{"$f":"+$L$6","v":"Jueves"}]
[null,null,null,{"$f":"+$D$7","v":"E1 - A1-1 Basico"},null,null,{"$f":"+$G$7","v":"Chris"},null,null,"Hora",{"$f":"+$K$7","v":"16:30:00"},{"$f":"+$L$7","v":"18:30:00"}]
[]
["Objectivo Hablar",null,null,"Objectivo Escribir",null,null,"Objectivo Escuchar",null,null,"Objectivo Leer"]
[{"$f":"+$A$10","v":1},null,null,{"$f":"+$D$10","v":2},null,null,{"$f":"+$G$10","v":3},null,null,{"$f":"+$J$10","v":4}]
["Capacidades",null,"Puntuación %",null,"Objetivos alcanzados",null,"Puntos Fuertes",null,null,"Puntos Debíles"]
[]
["Hablar",null,0.9,null,"Si o No",null,"•\n•\n•",null,null,"•\n•\n•"]
["Escribir",null,0.1,null,"Si o No"]
["Escuchar",null,0.9,null,"Si o No"]
["Leer",null,0.8,null,"Si o No"]
[]
["Asistencia",null,null,null,null,null,"Comentarios"]
[{"$f":"+$A$19","v":"2019-01-01"},{"$f":"+'EOT1 Asis'!F41","v":0},{"$f":"SUM(C111:D114)/4","v":0.67500000000000004},null,"Excelente"]
[{"$f":"+$A$20","v":"2019-02-01"},{"$f":"+'EOT1 Asis'!F42","v":0},null,null,"Muy Bueno"]
[{"$f":"+$A$21","v":"2019-03-01"},{"$f":"+'EOT1 Asis'!F43","v":0},null,null,"Bueno"]
[{"$f":"+$A$22","v":"2019-04-01"},{"$f":"+'EOT1 Asis'!F44","v":0},null,null,"Satisfactaria"]
["Total",{"$f":"+'EOT1 Asis'!L14","v":0}]
[]
[]
[]
[]
[]
[]
[]
[]
[]
[]
["Cliente",null,null,null,null,null,null,"Informe trimestral",null,null,{"$f":"+$K$1","v":"ene - abr"}]
[]
[{"$f":"+$A$3","v":"Rainbow Inc"}]
["Estudiante",null,null,null,null,null,null,null,null,"Horario"]
[]
[{"$f":"+Calendar!B46","v":"Bungle"},null,null,"Grupo / nivel",null,null,"Profesor",null,null,"Dias",{"$f":"+$K$6","v":"Martes"},{"$f":"+$L$6","v":"Jueves"}]
[null,null,null,{"$f":"+$D$7","v":"E1 - A1-1 Basico"},null,null,{"$f":"+$G$7","v":"Chris"},null,null,"Hora",{"$f":"+$K$7","v":"16:30:00"},{"$f":"+$L$7","v":"18:30:00"}]
[]
["Objectivo Hablar",null,null,"Objectivo Escribir",null,null,"Objectivo Escuchar",null,null,"Objectivo Leer"]
[{"$f":"+$A$10","v":1},null,null,{"$f":"+$D$10","v":2},null,null,{"$f":"+$G$10","v":3},null,null,{"$f":"+$J$10","v":4}]
["Capacidades",null,"Puntuación %",null,"Objetivos alcanzados",null,"Puntos Fuertes",null,null,"Puntos Debíles"]
[]
["Hablar",null,0.9,null,"Si o No",null,"•\n•\n•",null,null,"•\n•\n•"]
["Escribir",null,0.1,null,"Si o No"]
["Escuchar",null,0.9,null,"Si o No"]
["Leer",null,0.8,null,"Si o No"]
[]
["Asistencia",null,null,null,null,null,"Comentarios"]
[{"$f":"+$A$19","v":"2019-01-01"},{"$f":"+'EOT1 Asis'!G41","v":0},{"$f":"SUM(C144:D147)/4","v":0.67500000000000004},null,"Excelente"]
[{"$f":"+$A$20","v":"2019-02-01"},{"$f":"+'EOT1 Asis'!G42","v":0},null,null,"Muy Bueno"]
[{"$f":"+$A$21","v":"2019-03-01"},{"$f":"+'EOT1 Asis'!G43","v":0},null,null,"Bueno"]
[{"$f":"+$A$22","v":"2019-04-01"},{"$f":"+'EOT1 Asis'!G44","v":0},null,null,"Satisfactaria"]
["Total",{"$f":"+'EOT1 Asis'!L16","v":0}]
[]
[]
[]
[]
[]
[]
[]
[]
[]
[]
["Cliente",null,null,null,null,null,null,"Informe trimestral",null,null,{"$f":"+$K$1","v":"ene - abr"}]
[]
[{"$f":"+$A$3","v":"Rainbow Inc"}]
["Estudiante",null,null,null,null,null,null,null,null,"Horario"]
[]
[{"$f":"+Calendar!B47","v":"Zippy"},null,null,"Grupo / nivel",null,null,"Profesor",null,null,"Dias",{"$f":"+$K$6","v":"Martes"},{"$f":"+$L$6","v":"Jueves"}]
[null,null,null,{"$f":"+$D$7","v":"E1 - A1-1 Basico"},null,null,{"$f":"+$G$7","v":"Chris"},null,null,"Hora",{"$f":"+$K$7","v":"16:30:00"},{"$f":"+$L$7","v":"18:30:00"}]
[]
["Objectivo Hablar",null,null,"Objectivo Escribir",null,null,"Objectivo Escuchar",null,null,"Objectivo Leer"]
[{"$f":"+$A$10","v":1},null,null,{"$f":"+$D$10","v":2},null,null,{"$f":"+$G$10","v":3},null,null,{"$f":"+$J$10","v":4}]
["Capacidades",null,"Puntuación %",null,"Objetivos alcanzados",null,"Puntos Fuertes",null,null,"Puntos Debíles"]
[]
["Hablar",null,0.9,null,"Si o No",null,"•\n•\n•",null,null,"•\n•\n•"]
["Escribir",null,0.1,null,"Si o No"]
["Escuchar",null,0.9,null,"Si o No"]
["Leer",null,0.8,null,"Si o No"]
[]
["Asistencia",null,null,null,null,null,"Comentarios"]
[{"$f":"+$A$19","v":"2019-01-01"},{"$f":"+'EOT1 Asis'!H41","v":0},{"$f":"SUM(C177:D180)/4","v":0.67500000000000004},null,"Excelente"]
[{"$f":"+$A$20","v":"2019-02-01"},{"$f":"+'EOT1 Asis'!H42","v":0},null,null,"Muy Bueno"]
[{"$f":"+$A$21","v":"2019-03-01"},{"$f":"+'EOT1 Asis'!H43","v":0},null,null,"Bueno"]
[{"$f":"+$A$22","v":"2019-04-01"},{"$f":"+'EOT1 Asis'!H44","v":0},null,null,"Satisfactaria"]
["Total",{"$f":"+'EOT1 Asis'!L17","v":0}]
[]
[]
[]
[]
[]
[]
[]
[]
[]
[]
["Cliente",null,null,null,null,null,null,"Informe trimestral",null,null,{"$f":"+$K$1","v":"ene - abr"}]
[]
[{"$f":"+$A$3","v":"Rainbow Inc"}]
["Estudiante",null,null,null,null,null,null,null,null,"Horario"]
[]
[{"$f":"+Calendar!B48","v":"Mathew"},null,null,"Grupo / nivel",null,null,"Profesor",null,null,"Dias",{"$f":"+$K$6","v":"Martes"},{"$f":"+$L$6","v":"Jueves"}]
[null,null,null,{"$f":"+$D$7","v":"E1 - A1-1 Basico"},null,null,{"$f":"+$G$7","v":"Chris"},null,null,"Hora",{"$f":"+$K$7","v":"16:30:00"},{"$f":"+$L$7","v":"18:30:00"}]
[]
["Objectivo Hablar",null,null,"Objectivo Escribir",null,null,"Objectivo Escuchar",null,null,"Objectivo Leer"]
[{"$f":"+$A$10","v":1},null,null,{"$f":"+$D$10","v":2},null,null,{"$f":"+$G$10","v":3},null,null,{"$f":"+$J$10","v":4}]
["Capacidades",null,"Puntuación %",null,"Objetivos alcanzados",null,"Puntos Fuertes",null,null,"Puntos Debíles"]
[]
["Hablar",null,0.9,null,"Si o No",null,"•\n•\n•",null,null,"•\n•\n•"]
["Escribir",null,0.1,null,"Si o No"]
["Escuchar",null,0.9,null,"Si o No"]
["Leer",null,0.8,null,"Si o No"]
[]
["Asistencia",null,null,null,null,null,"Comentarios"]
[{"$f":"+$A$19","v":"2019-01-01"},{"$f":"+'EOT1 Asis'!I41","v":0},{"$f":"SUM(C210:D213)/4","v":0.67500000000000004},null,"Excelente"]
[{"$f":"+$A$20","v":"2019-02-01"},{"$f":"+'EOT1 Asis'!I42","v":0},null,null,"Muy Bueno"]
[{"$f":"+$A$21","v":"2019-03-01"},{"$f":"+'EOT1 Asis'!I43","v":0},null,null,"Bueno"]
[{"$f":"+$A$22","v":"2019-04-01"},{"$f":"+'EOT1 Asis'!I44","v":0},null,null,"Satisfactaria"]
["Total",{"$f":"+'EOT1 Asis'!L18","v":0}]
[]
[]
[]
[]
[]
[]
[]
[]
[]
[]
["Cliente",null,null,null,null,null,null,"Informe trimestral",null,null,{"$f":"+$K$1","v":"ene - abr"}]
[]
[{"$f":"+$A$3","v":"Rainbow Inc"}]
["Estudiante",null,null,null,null,null,null,null,null,"Horario"]
[]
[{"$f":"+Calendar!B49","v":"Sooty"},null,null,"Grupo / nivel",null,null,"Profesor",null,null,"Dias",{"$f":"+$K$6","v":"Martes"},{"$f":"+$L$6","v":"Jueves"}]
[null,null,null,{"$f":"+$D$7","v":"E1 - A1-1 Basico"},null,null,{"$f":"+$G$7","v":"Chris"},null,null,"Hora",{"$f":"+$K$7","v":"16:30:00"},{"$f":"+$L$7","v":"18:30:00"}]
[]
["Objectivo Hablar",null,null,"Objectivo Escribir",null,null,"Objectivo Escuchar",null,null,"Objectivo Leer"]
[{"$f":"+$A$10","v":1},null,null,{"$f":"+$D$10","v":2},null,null,{"$f":"+$G$10","v":3},null,null,{"$f":"+$J$10","v":4}]
["Capacidades",null,"Puntuación %",null,"Objetivos alcanzados",null,"Puntos Fuertes",null,null,"Puntos Debíles"]
[]
["Hablar",null,0.9,null,"Si o No",null,"•\n•\n•",null,null,"•\n•\n•"]
["Escribir",null,0.1,null,"Si o No"]
["Escuchar",null,0.9,null,"Si o No"]
["Leer",null,0.8,null,"Si o No"]
[]
["Asistencia",null,null,null,null,null,"Comentarios"]
[{"$f":"+$A$19","v":"2019-01-01"},{"$f":"+'EOT1 Asis'!J41","v":0},{"$f":"SUM(C243:D246)/4","v":0.67500000000000004},null,"Excelente"]
[{"$f":"+$A$20","v":"2019-02-01"},{"$f":"+'EOT1 Asis'!J42","v":0},null,null,"Muy Bueno"]
[{"$f":"+$A$21","v":"2019-03-01"},{"$f":"+'EOT1 Asis'!J43","v":0},null,null,"Bueno"]
[{"$f":"+$A$22","v":"2019-04-01"},{"$f":"+'EOT1 Asis'!J44","v":0},null,null,"Satisfactaria"]
["Total",{"$f":"+'EOT1 Asis'!L19","v":0}]
[]
[]
[]
[]
[]
[]
[]
[]
[]
[]
["Cliente",null,null,null,null,null,null,"Informe trimestral",null,null,{"$f":"+$K$1","v":"ene - abr"}]
[]
[{"$f":"+$A$3","v":"Rainbow Inc"}]
["Estudiante",null,null,null,null,null,null,null,null,"Horario"]
[]
[{"$f":"+Calendar!B50","v":"Sweep"},null,null,"Grupo / nivel",null,null,"Profesor",null,null,"Dias",{"$f":"+$K$6","v":"Martes"},{"$f":"+$L$6","v":"Jueves"}]
[null,null,null,{"$f":"+$D$7","v":"E1 - A1-1 Basico"},null,null,{"$f":"+$G$7","v":"Chris"},null,null,"Hora",{"$f":"+$K$7","v":"16:30:00"},{"$f":"+$L$7","v":"18:30:00"}]
[]
["Objectivo Hablar",null,null,"Objectivo Escribir",null,null,"Objectivo Escuchar",null,null,"Objectivo Leer"]
[{"$f":"+$A$10","v":1},null,null,{"$f":"+$D$10","v":2},null,null,{"$f":"+$G$10","v":3},null,null,{"$f":"+$J$10","v":4}]
["Capacidades",null,"Puntuación %",null,"Objetivos alcanzados",null,"Puntos Fuertes",null,null,"Puntos Debíles"]
[]
["Hablar",null,0.9,null,"Si o No",null,"•\n•\n•",null,null,"•\n•\n•"]
["Escribir",null,0.1,null,"Si o No"]
["Escuchar",null,0.9,null,"Si o No"]
["Leer",null,0.8,null,"Si o No"]
[]
["Asistencia",null,null,null,null,null,"Comentarios"]
[{"$f":"+$A$19","v":"2019-01-01"},{"$f":"+'EOT1 Asis'!K41","v":0},{"$f":"SUM(C276:D279)/4","v":0.67500000000000004},null,"Excelente"]
[{"$f":"+$A$20","v":"2019-02-01"},{"$f":"+'EOT1 Asis'!K42","v":0},null,null,"Muy Bueno"]
[{"$f":"+$A$21","v":"2019-03-01"},{"$f":"+'EOT1 Asis'!K43","v":0},null,null,"Bueno"]
[{"$f":"+$A$22","v":"2019-04-01"},{"$f":"+'EOT1 Asis'!K44","v":0},null,null,"Satisfactaria"]
["Total",{"$f":"+'EOT1 Asis'!L20","v":0}]
[]
[]
[]
[]
[]
[]
[]
[]
[]
[]
["Cliente",null,null,null,null,null,null,"Informe trimestral",null,null,{"$f":"+$K$1","v":"ene - abr"}]
[]
[{"$f":"+$A$3","v":"Rainbow Inc"}]
["Estudiante",null,null,null,null,null,null,null,null,"Horario"]
[]
[{"$f":"+Calendar!B51","v":"Sue"},null,null,"Grupo / nivel",null,null,"Profesor",null,null,"Dias",{"$f":"+$K$6","v":"Martes"},{"$f":"+$L$6","v":"Jueves"}]
[null,null,null,{"$f":"+$D$7","v":"E1 - A1-1 Basico"},null,null,{"$f":"+$G$7","v":"Chris"},null,null,"Hora",{"$f":"+$K$7","v":"16:30:00"},{"$f":"+$L$7","v":"18:30:00"}]
[]
["Objectivo Hablar",null,null,"Objectivo Escribir",null,null,"Objectivo Escuchar",null,null,"Objectivo Leer"]
[{"$f":"+$A$10","v":1},null,null,{"$f":"+$D$10","v":2},null,null,{"$f":"+$G$10","v":3},null,null,{"$f":"+$J$10","v":4}]
["Capacidades",null,"Puntuación %",null,"Objetivos alcanzados",null,"Puntos Fuertes",null,null,"Puntos Debíles"]
[]
["Hablar",null,0.9,null,"Si o No",null,"•\n•\n•",null,null,"•\n•\n•"]
["Escribir",null,0.1,null,"Si o No"]
["Escuchar",null,0.9,null,"Si o No"]
["Leer",null,0.8,null,"Si o No"]
[]
["Asistencia",null,null,null,null,null,"Comentarios"]
[{"$f":"+$A$19","v":"2019-01-01"},{"$f":"+'EOT1 Asis'!L41","v":0},{"$f":"SUM(C309:D312)/4","v":0.67500000000000004},null,"Excelente"]
[{"$f":"+$A$20","v":"2019-02-01"},{"$f":"+'EOT1 Asis'!L42","v":0},null,null,"Muy Bueno"]
[{"$f":"+$A$21","v":"2019-03-01"},{"$f":"+'EOT1 Asis'!L43","v":0},null,null,"Bueno"]
[{"$f":"+$A$22","v":"2019-04-01"},{"$f":"+'EOT1 Asis'!L44","v":0},null,null,"Satisfactaria"]
["Total",{"$f":"+'EOT1 Asis'!L21","v":0}]

{"sheet":"Obj2","index":8,"n_rows":10,"n_cols":12,"rows_kept":10,"cut":false,"hidden":true,"merged":[[0,0,1,2],[0,7,1,9],[0,10,1,11],[2,0,2,2],[3,0,4,2],[3,9,4,11],[5,3,5,5],[5,6,5,8],[6,3,6,5],[6,6,6,8],[5,0,5,2],[6,0,6,2],[8,9,8,11],[9,0,11,2],[9,3,11,5],[9,6,11,8],[9,9,11,11],[8,0,8,2],[8,3,8,5],[8,6,8,8]]}
["Cliente",null,null,null,null,null,null,"Trimestre ",null,null,"abr - jun"]
[]
[{"$f":"+Calendar!A5","v":"Rainbow Inc"}]
["Dirección",null,null,null,null,null,null,null,null,"Horario"]
[]
[{"$f":"+Calendar!AI2","v":"Toy street 1"},null,null,"Grupo / nivel",null,null,"Profesor",null,null,"Dias",{"$f":"+Calendar!AI12","v":"Martes"},{"$f":"+Calendar!AI14","v":"Jueves"}]
[{"$f":"+Calendar!AI3","v":"Barcelona"},null,null,{"$f":"+Calendar!Q5","v":"E1 - A1-1 Basico"},null,null,{"$f":"+Calendar!AI21","v":"Chris"},null,null,"Hora",{"$f":"+Calendar!AI17","v":"16:30:00"},{"$f":"+Calendar!AI18","v":"18:30:00"}]
[]
["Objectivo Hablar",null,null,"Objectivo Escribir",null,null,"Objectivo Escuchar",null,null,"Objectivo Leer"]
[5,null,null,6,null,null,7,null,null,8]

{"sheet":"may","index":9,"n_rows":78,"n_cols":12,"rows_kept":78,"cut":false,"hidden":true,"merged":[[5,0,5,2],[5,3,5,5],[5,6,5,8],[6,0,6,2],[6,3,6,5],[6,6,6,8],[0,0,1,2],[0,9,1,9],[0,10,1,11],[2,0,2,2],[3,0,4,2],[3,9,4,11],[12,1,12,3],[12,4,12,6],[12,7,12,11],[13,1,13,3],[13,4,13,6],[13,7,13,11],[8,1,9,3],[8,4,9,6],[8,7,9,11],[10,1,10,3],[10,4,10,6],[10,7,11,11],[11,1,11,3],[11,4,11,6],[19,1,19,3],[19,4,19,6],[19,7,19,11],[20,1,20,3],[20,4,20,6],[20,7,20,11],[15,1,16,3],[15,4,16,6],[15,7,16,11],[17,1,17,3],[17,4,17,6],[17,7,18,11],[18,1,18,3],[18,4,18,6],[26,1,26,3],[26,4,26,6],[26,7,26,11],[27,1,27,3],[27,4,27,6],[27,7,27,11],[22,1,23,3],[22,4,23,6],[22,7,23,11],[24,1,24,3],[24,4,24,6],[24,7,25,11],[25,1,25,3],[25,4,25,6],[33,1,33,3],[33,4,33,6],[33,7,33,11],[34,1,34,3],[34,4,34,6],[34,7,34,11],[29,1,30,3],[29,4,30,6],[29,7,30,11],[31,1,31,3],[31,4,31,6],[31,7,32,11],[32,1,32,3],[32,4,32,6],[40,1,40,3],[40,4,40,6],[40,7,40,11],[41,1,41,3],[41,4,41,6],[41,7,41,11],[36,1,37,3],[36,4,37,6],[36,7,37,11],[38,1,38,3],[38,4,38,6],[38,7,39,11],[39,1,39,3],[39,4,39,6],[47,1,47,3],[47,4,47,6],[47,7,47,11],[48,1,48,3],[48,4,48,6],[48,7,48,11],[43,4,44,6],[43,7,44,11],[45,1,45,3],[45,4,45,6],[45,7,46,11],[46,1,46,3],[46,4,46,6],[43,1,44,3],[54,1,54,3],[54,4,54,6],[54,7,54,11],[55,1,55,3],[55,4,55,6],[55,7,55,11],[50,1,51,3],[50,4,51,6],[50,7,51,11],[52,1,52,3],[52,4,52,6],[52,7,53,11],[53,1,53,3],[53,4,53,6],[62,1,62,3],[62,4,62,6],[62,7,62,11],[63,1,63,3],[63,4,63,6],[63,7,63,11],[58,1,59,3],[58,4,59,6],[58,7,59,11],[60,1,60,3],[60,4,60,6],[60,7,61,11],[61,1,61,3],[61,4,61,6],[69,1,69,3],[69,4,69,6],[69,7,69,11],[70,1,70,3],[70,4,70,6],[70,7,70,11],[65,1,66,3],[65,4,66,6],[65,7,66,11],[67,1,67,3],[67,4,67,6],[67,7,68,11],[68,1,68,3],[68,4,68,6],[76,1,76,3],[76,4,76,6],[76,7,76,11],[77,1,77,3],[77,4,77,6],[77,7,77,11],[72,1,73,3],[72,4,73,6],[72,7,73,11],[74,1,74,3],[74,4,74,6],[74,7,75,11],[75,1,75,3],[75,4,75,6]]}
["Cliente",null,null,null,null,null,null,null,null,"Mes",{"$f":"+mayF!K1:L2","v":"2019-05-01"}]
[]
[{"$f":"+Calendar!A5","v":"Rainbow Inc"}]
["Libros",null,null,null,null,null,null,null,null,"Horario"]
[]
[null,null,null,"Grupo / nivel",null,null,"Profesor",null,null,"Dias",{"$f":"+Calendar!AI12","v":"Martes"},{"$f":"+Calendar!AI14","v":"Jueves"}]
[null,null,null,{"$f":"+Calendar!Q5","v":"E1 - A1-1 Basico"},null,null,{"$f":"+Calendar!AI21","v":"Chris"},null,null,"Hora",{"$f":"+Calendar!AI17","v":"16:30:00"},{"$f":"+Calendar!AI18","v":"18:30:00"}]
[]
["Date","Material",null,null,"Content",null,null,"Aim"]
[{"$f":"+mayF!C9","v":"2019-05-02"}]
["Speaking"]
["Writing"]
["Listening",null,null,null,null,null,null,"Comments"]
["Reading"]
[]
["Date","Material",null,null,"Content",null,null,"Aim"]
[{"$f":"+mayF!D9","v":"2019-05-07"},"Coursebook"]
["Speaking"]
["Writing"]
["Listening",null,null,null,null,null,null,"Comments"]
["Reading"]
[]
["Date","Material",null,null,"Content",null,null,"Aim"]
[{"$f":"+mayF!E9","v":"2019-05-09"},"Coursebook"]
["Speaking"]
["Writing"]
["Listening",null,null,null,null,null,null,"Comments"]
["Reading"]
[]
["Date","Material",null,null,"Content",null,null,"Aim"]
[{"$f":"+mayF!F9","v":"2019-05-14"},"Coursebook"]
["Speaking"]
["Writing"]
["Listening",null,null,null,null,null,null,"Comments"]
["Reading"]
[]
["Date","Material",null,null,"Content",null,null,"Aim"]
[{"$f":"+mayF!G9","v":"2019-05-16"},"Coursebook"]
["Speaking"]
["Writing"]
["Listening",null,null,null,null,null,null,"Comments"]
["Reading"]
[]
["Date","Material",null,null,"Content",null,null,"Aim"]
[{"$f":"+mayF!H9","v":"2019-05-21"},"Coursebook"]
["Speaking"]
["Writing"]
["Listening",null,null,null,null,null,null,"Comments"]
["Reading"]
[]
["Date","Material",null,null,"Content",null,null,"Aim"]
[{"$f":"+mayF!I9","v":"2019-05-23"},"Coursebook"]
["Speaking"]
["Writing"]
["Listening",null,null,null,null,null,null,"Comments"]
["Reading"]
[]
[]
["Date","Material",null,null,"Content",null,null,"Aim"]
[{"$f":"+mayF!J9","v":"2019-05-28"},"Coursebook"]
["Speaking"]
["Writing"]
["Listening",null,null,null,null,null,null,"Comments"]
["Reading"]
[]
["Date","Material",null,null,"Content",null,null,"Aim"]
[{"$f":"+mayF!K9","v":"2019-05-30"},"Coursebook"]
["Speaking"]
["Writing"]
["Listening",null,null,null,null,null,null,"Comments"]
["Reading"]
[]
["Date","Material",null,null,"Content",null,null,"Aim"]
[{"$f":"+mayF!L9","v":""},"Coursebook"]
["Speaking"]
["Writing"]
["Listening",null,null,null,null,null,null,"Comments"]
["Reading"]

{"sheet":"jun","index":10,"n_rows":78,"n_cols":12,"rows_kept":78,"cut":false,"hidden":true,"merged":[[5,0,5,2],[5,3,5,5],[5,6,5,8],[6,0,6,2],[6,3,6,5],[6,6,6,8],[0,0,1,2],[0,9,1,9],[0,10,1,11],[2,0,2,2],[3,0,4,2],[3,9,4,11],[12,1,12,3],[12,4,12,6],[12,7,12,11],[13,1,13,3],[13,4,13,6],[13,7,13,11],[8,1,9,3],[8,4,9,6],[8,7,9,11],[10,1,10,3],[10,4,10,6],[10,7,11,11],[11,1,11,3],[11,4,11,6],[19,1,19,3],[19,4,19,6],[19,7,19,11],[20,1,20,3],[20,4,20,6],[20,7,20,11],[15,1,16,3],[15,4,16,6],[15,7,16,11],[17,1,17,3],[17,4,17,6],[17,7,18,11],[18,1,18,3],[18,4,18,6],[26,1,26,3],[26,4,26,6],[26,7,26,11],[27,1,27,3],[27,4,27,6],[27,7,27,11],[22,1,23,3],[22,4,23,6],[22,7,23,11],[24,1,24,3],[24,4,24,6],[24,7,25,11],[25,1,25,3],[25,4,25,6],[33,1,33,3],[33,4,33,6],[33,7,33,11],[34,1,34,3],[34,4,34,6],[34,7,34,11],[29,1,30,3],[29,4,30,6],[29,7,30,11],[31,1,31,3],[31,4,31,6],[31,7,32,11],[32,1,32,3],[32,4,32,6],[40,1,40,3],[40,4,40,6],[40,7,40,11],[41,1,41,3],[41,4,41,6],[41,7,41,11],[36,1,37,3],[36,4,37,6],[36,7,37,11],[38,1,38,3],[38,4,38,6],[38,7,39,11],[39,1,39,3],[39,4,39,6],[47,1,47,3],[47,4,47,6],[47,7,47,11],[48,1,48,3],[48,4,48,6],[48,7,48,11],[43,4,44,6],[43,7,44,11],[45,1,45,3],[45,4,45,6],[45,7,46,11],[46,1,46,3],[46,4,46,6],[43,1,44,3],[54,1,54,3],[54,4,54,6],[54,7,54,11],[55,1,55,3],[55,4,55,6],[55,7,55,11],[50,1,51,3],[50,4,51,6],[50,7,51,11],[52,1,52,3],[52,4,52,6],[52,7,53,11],[53,1,53,3],[53,4,53,6],[62,1,62,3],[62,4,62,6],[62,7,62,11],[63,1,63,3],[63,4,63,6],[63,7,63,11],[58,1,59,3],[58,4,59,6],[58,7,59,11],[60,1,60,3],[60,4,60,6],[60,7,61,11],[61,1,61,3],[61,4,61,6],[69,1,69,3],[69,4,69,6],[69,7,69,11],[70,1,70,3],[70,4,70,6],[70,7,70,11],[65,1,66,3],[65,4,66,6],[65,7,66,11],[67,1,67,3],[67,4,67,6],[67,7,68,11],[68,1,68,3],[68,4,68,6],[76,1,76,3],[76,4,76,6],[76,7,76,11],[77,1,77,3],[77,4,77,6],[77,7,77,11],[72,1,73,3],[72,4,73,6],[72,7,73,11],[74,1,74,3],[74,4,74,6],[74,7,75,11],[75,1,75,3],[75,4,75,6]]}
["Cliente",null,null,null,null,null,null,null,null,"Mes",{"$f":"+junF!K1","v":"2019-06-01"}]
[]
[{"$f":"+Calendar!A5","v":"Rainbow Inc"}]
["Libros",null,null,null,null,null,null,null,null,"Horario"]
[]
[null,null,null,"Grupo / nivel",null,null,"Profesor",null,null,"Dias",{"$f":"+Calendar!AI12","v":"Martes"},{"$f":"+Calendar!AI14","v":"Jueves"}]
[null,null,null,{"$f":"+Calendar!Q5","v":"E1 - A1-1 Basico"},null,null,{"$f":"+Calendar!AI21","v":"Chris"},null,null,"Hora",{"$f":"+Calendar!AI17","v":"16:30:00"},{"$f":"+Calendar!AI18","v":"18:30:00"}]
[]
["Date","Material",null,null,"Content",null,null,"Aim"]
[{"$f":"+junF!C9","v":"2019-06-04"}]
["Speaking"]
["Writing"]
["Listening",null,null,null,null,null,null,"Comments"]
["Reading"]
[]
["Date","Material",null,null,"Content",null,null,"Aim"]
[{"$f":"+junF!D9","v":"2019-06-06"},"Coursebook"]
["Speaking"]
["Writing"]
["Listening",null,null,null,null,null,null,"Comments"]
["Reading"]
[]
["Date","Material",null,null,"Content",null,null,"Aim"]
[{"$f":"+junF!E9","v":"2019-06-11"},"Coursebook"]
["Speaking"]
["Writing"]
["Listening",null,null,null,null,null,null,"Comments"]
["Reading"]
[]
["Date","Material",null,null,"Content",null,null,"Aim"]
[{"$f":"+junF!F9","v":"2019-06-13"},"Coursebook"]
["Speaking"]
["Writing"]
["Listening",null,null,null,null,null,null,"Comments"]
["Reading"]
[]
["Date","Material",null,null,"Content",null,null,"Aim"]
[{"$f":"+junF!G9","v":"2019-06-18"},"Coursebook"]
["Speaking"]
["Writing"]
["Listening",null,null,null,null,null,null,"Comments"]
["Reading"]
[]
["Date","Material",null,null,"Content",null,null,"Aim"]
[{"$f":"+junF!H9","v":"2019-06-20"},"Coursebook"]
["Speaking"]
["Writing"]
["Listening",null,null,null,null,null,null,"Comments"]
["Reading"]
[]
["Date","Material",null,null,"Content",null,null,"Aim"]
[{"$f":"+junF!I9","v":"2019-06-25"},"Coursebook"]
["Speaking"]
["Writing"]
["Listening",null,null,null,null,null,null,"Comments"]
["Reading"]
[]
[]
["Date","Material",null,null,"Content",null,null,"Aim"]
[{"$f":"+junF!J9","v":"2019-06-27"},"Coursebook"]
["Speaking"]
["Writing"]
["Listening",null,null,null,null,null,null,"Comments"]
["Reading"]
[]
["Date","Material",null,null,"Content",null,null,"Aim"]
[{"$f":"+junF!K9","v":""},"Coursebook"]
["Speaking"]
["Writing"]
["Listening",null,null,null,null,null,null,"Comments"]
["Reading"]
[]
["Date","Material",null,null,"Content",null,null,"Aim"]
[{"$f":"+junF!L9","v":""},"Coursebook"]
["Speaking"]
["Writing"]
["Listening",null,null,null,null,null,null,"Comments"]
["Reading"]

{"sheet":"jul","index":11,"n_rows":78,"n_cols":12,"rows_kept":78,"cut":false,"hidden":true,"merged":[[5,0,5,2],[5,3,5,5],[5,6,5,8],[6,0,6,2],[6,3,6,5],[6,6,6,8],[0,0,1,2],[0,9,1,9],[0,10,1,11],[2,0,2,2],[3,0,4,2],[3,9,4,11],[12,1,12,3],[12,4,12,6],[12,7,12,11],[13,1,13,3],[13,4,13,6],[13,7,13,11],[8,1,9,3],[8,4,9,6],[8,7,9,11],[10,1,10,3],[10,4,10,6],[10,7,11,11],[11,1,11,3],[11,4,11,6],[19,1,19,3],[19,4,19,6],[19,7,19,11],[20,1,20,3],[20,4,20,6],[20,7,20,11],[15,1,16,3],[15,4,16,6],[15,7,16,11],[17,1,17,3],[17,4,17,6],[17,7,18,11],[18,1,18,3],[18,4,18,6],[26,1,26,3],[26,4,26,6],[26,7,26,11],[27,1,27,3],[27,4,27,6],[27,7,27,11],[22,1,23,3],[22,4,23,6],[22,7,23,11],[24,1,24,3],[24,4,24,6],[24,7,25,11],[25,1,25,3],[25,4,25,6],[33,1,33,3],[33,4,33,6],[33,7,33,11],[34,1,34,3],[34,4,34,6],[34,7,34,11],[29,1,30,3],[29,4,30,6],[29,7,30,11],[31,1,31,3],[31,4,31,6],[31,7,32,11],[32,1,32,3],[32,4,32,6],[40,1,40,3],[40,4,40,6],[40,7,40,11],[41,1,41,3],[41,4,41,6],[41,7,41,11],[36,1,37,3],[36,4,37,6],[36,7,37,11],[38,1,38,3],[38,4,38,6],[38,7,39,11],[39,1,39,3],[39,4,39,6],[47,1,47,3],[47,4,47,6],[47,7,47,11],[48,1,48,3],[48,4,48,6],[48,7,48,11],[43,1,44,3],[43,4,44,6],[43,7,44,11],[45,1,45,3],[45,4,45,6],[45,7,46,11],[46,1,46,3],[46,4,46,6],[54,1,54,3],[54,4,54,6],[54,7,54,11],[55,1,55,3],[55,4,55,6],[55,7,55,11],[50,1,51,3],[50,4,51,6],[50,7,51,11],[52,1,52,3],[52,4,52,6],[52,7,53,11],[53,1,53,3],[53,4,53,6],[62,1,62,3],[62,4,62,6],[62,7,62,11],[63,1,63,3],[63,4,63,6],[63,7,63,11],[58,1,59,3],[58,4,59,6],[58,7,59,11],[60,1,60,3],[60,4,60,6],[60,7,61,11],[61,1,61,3],[61,4,61,6],[69,1,69,3],[69,4,69,6],[69,7,69,11],[70,1,70,3],[70,4,70,6],[70,7,70,11],[65,1,66,3],[65,4,66,6],[65,7,66,11],[67,1,67,3],[67,4,67,6],[67,7,68,11],[68,1,68,3],[68,4,68,6],[76,1,76,3],[76,4,76,6],[76,7,76,11],[77,1,77,3],[77,4,77,6],[77,7,77,11],[72,1,73,3],[72,4,73,6],[72,7,73,11],[74,1,74,3],[74,4,74,6],[74,7,75,11],[75,1,75,3],[75,4,75,6]]}
["Cliente",null,null,null,null,null,null,null,null,"Mes",{"$f":"+julF!K1","v":"2019-07-01"}]
[]
[{"$f":"+Calendar!A5","v":"Rainbow Inc"}]
["Libros",null,null,null,null,null,null,null,null,"Horario"]
[]
[null,null,null,"Grupo / nivel",null,null,"Profesor",null,null,"Dias",{"$f":"+Calendar!AI12","v":"Martes"},{"$f":"+Calendar!AI14","v":"Jueves"}]
[null,null,null,{"$f":"+Calendar!Q5","v":"E1 - A1-1 Basico"},null,null,{"$f":"+Calendar!AI21","v":"Chris"},null,null,"Hora",{"$f":"+Calendar!AI17","v":"16:30:00"},{"$f":"+Calendar!AI18","v":"18:30:00"}]
[]
["Date","Material",null,null,"Content",null,null,"Aim"]
[{"$f":"+julF!C9","v":"2019-07-02"}]
["Speaking"]
["Writing"]
["Listening",null,null,null,null,null,null,"Comments"]
["Reading"]
[]
["Date","Material",null,null,"Content",null,null,"Aim"]
[{"$f":"+julF!D9","v":"2019-07-04"},"Coursebook"]
["Speaking"]
["Writing"]
["Listening",null,null,null,null,null,null,"Comments"]
["Reading"]
[]
["Date","Material",null,null,"Content",null,null,"Aim"]
[{"$f":"+julF!E9","v":"2019-07-09"},"Coursebook"]
["Speaking"]
["Writing"]
["Listening",null,null,null,null,null,null,"Comments"]
["Reading"]
[]
["Date","Material",null,null,"Content",null,null,"Aim"]
[{"$f":"+julF!F9","v":"2019-07-11"},"Coursebook"]
["Speaking"]
["Writing"]
["Listening",null,null,null,null,null,null,"Comments"]
["Reading"]
[]
["Date","Material",null,null,"Content",null,null,"Aim"]
[{"$f":"+julF!G9","v":"2019-07-16"},"Coursebook"]
["Speaking"]
["Writing"]
["Listening",null,null,null,null,null,null,"Comments"]
["Reading"]
[]
["Date","Material",null,null,"Content",null,null,"Aim"]
[{"$f":"+julF!H9","v":"2019-07-18"},"Coursebook"]
["Speaking"]
["Writing"]
["Listening",null,null,null,null,null,null,"Comments"]
["Reading"]
[]
["Date","Material",null,null,"Content",null,null,"Aim"]
[{"$f":"+julF!I9","v":"2019-07-23"},"Coursebook"]
["Speaking"]
["Writing"]
["Listening",null,null,null,null,null,null,"Comments"]
["Reading"]
[]
[]
["Date","Material",null,null,"Content",null,null,"Aim"]
[{"$f":"+julF!J9","v":"2019-07-25"},"Coursebook"]
["Speaking"]
["Writing"]
["Listening",null,null,null,null,null,null,"Comments"]
["Reading"]
[]
["Date","Material",null,null,"Content",null,null,"Aim"]
[{"$f":"+julF!K9","v":"2019-07-30"},"Coursebook"]
["Speaking"]
["Writing"]
["Listening",null,null,null,null,null,null,"Comments"]
["Reading"]
[]
["Date","Material",null,null,"Content",null,null,"Aim"]
[{"$f":"+julF!L9","v":""},"Coursebook"]
["Speaking"]
["Writing"]
["Listening",null,null,null,null,null,null,"Comments"]
["Reading"]

{"sheet":"EOT2","index":12,"n_rows":319,"n_cols":12,"rows_kept":319,"cut":false,"hidden":true,"merged":[[0,10,1,11],[2,0,2,2],[3,0,4,2],[17,0,17,1],[17,2,17,5],[12,0,12,1],[12,2,12,3],[12,4,12,5],[3,9,4,11],[5,0,6,2],[5,3,5,5],[5,6,5,8],[6,3,6,5],[6,6,6,8],[0,0,1,2],[0,7,1,9],[12,6,15,8],[12,9,15,11],[13,0,13,1],[13,2,13,3],[13,4,13,5],[14,0,14,1],[14,2,14,3],[8,9,8,11],[8,0,8,2],[8,3,8,5],[8,6,8,8],[17,6,17,11],[18,2,22,3],[18,4,18,5],[18,6,22,11],[19,4,19,5],[20,4,20,5],[21,4,21,5],[22,4,22,5],[15,2,15,3],[15,4,15,5],[10,9,10,11],[14,4,14,5],[15,0,15,1],[9,0,9,2],[9,3,9,5],[9,6,9,8],[9,9,9,11],[10,0,10,1],[10,2,10,3],[10,4,10,5],[10,6,10,8],[37,0,38,2],[37,3,37,5],[37,6,37,8],[38,3,38,5],[38,6,38,8],[40,0,40,2],[40,3,40,5],[40,6,40,8],[32,0,33,2],[32,7,33,9],[35,0,36,2],[35,9,36,11],[40,9,40,11],[32,10,33,11],[34,0,34,2],[41,0,41,2],[41,3,41,5],[41,6,41,8],[41,9,41,11],[42,0,42,1],[42,2,42,3],[42,4,42,5],[42,6,42,8],[42,9,42,11],[68,0,69,2],[68,9,69,11],[49,6,49,11],[50,2,54,3],[50,4,50,5],[50,6,54,11],[51,4,51,5],[52,4,52,5],[53,4,53,5],[54,4,54,5],[65,0,66,2],[65,7,66,9],[49,0,49,1],[49,2,49,5],[44,0,44,1],[44,2,44,3],[44,4,44,5],[65,10,66,11],[67,0,67,2],[44,6,47,8],[44,9,47,11],[45,0,45,1],[45,2,45,3],[45,4,45,5],[46,0,46,1],[46,2,46,3],[46,4,46,5],[47,0,47,1],[47,2,47,3],[47,4,47,5],[79,4,79,5],[80,0,80,1],[80,2,80,3],[80,4,80,5],[70,0,71,2],[70,3,70,5],[70,6,70,8],[71,3,71,5],[71,6,71,8],[73,0,73,2],[73,3,73,5],[73,6,73,8],[73,9,73,11],[74,0,74,2],[74,3,74,5],[74,6,74,8],[74,9,74,11],[75,0,75,1],[75,2,75,3],[75,4,75,5],[75,6,75,8],[75,9,75,11],[82,0,82,1],[82,2,82,5],[77,0,77,1],[77,2,77,3],[77,4,77,5],[98,10,99,11],[100,0,100,2],[101,0,102,2],[101,9,102,11],[82,6,82,11],[83,2,87,3],[83,4,83,5],[83,6,87,11],[84,4,84,5],[85,4,85,5],[86,4,86,5],[87,4,87,5],[77,6,80,8],[77,9,80,11],[78,0,78,1],[78,2,78,3],[78,4,78,5],[79,0,79,1],[79,2,79,3],[103,0,104,2],[103,3,103,5],[103,6,103,8],[104,3,104,5],[104,6,104,8],[106,0,106,2],[106,3,106,5],[106,6,106,8],[98,0,99,2],[98,7,99,9],[106,9,106,11],[107,0,107,2],[107,3,107,5],[107,6,107,8],[107,9,107,11],[108,0,108,1],[108,2,108,3],[108,4,108,5],[108,6,108,8],[108,9,108,11],[134,0,135,2],[134,9,135,11],[115,6,115,11],[116,2,120,3],[116,4,116,5],[116,6,120,11],[117,4,117,5],[118,4,118,5],[119,4,119,5],[120,4,120,5],[131,0,132,2],[131,7,132,9],[115,0,115,1],[115,2,115,5],[110,0,110,1],[110,2,110,3],[110,4,110,5],[131,10,132,11],[133,0,133,2],[110,6,113,8],[110,9,113,11],[111,0,111,1],[111,2,111,3],[111,4,111,5],[112,0,112,1],[112,2,112,3],[112,4,112,5],[113,0,113,1],[113,2,113,3],[113,4,113,5],[145,4,145,5],[146,0,146,1],[146,2,146,3],[146,4,146,5],[136,0,137,2],[136,3,136,5],[136,6,136,8],[137,3,137,5],[137,6,137,8],[139,0,139,2],[139,3,139,5],[139,6,139,8],[139,9,139,11],[140,0,140,2],[140,3,140,5],[140,6,140,8],[140,9,140,11],[141,0,141,1],[141,2,141,3],[141,4,141,5],[141,6,141,8],[141,9,141,11],[148,0,148,1],[148,2,148,5],[143,0,143,1],[143,2,143,3],[143,4,143,5],[164,10,165,11],[166,0,166,2],[167,0,168,2],[167,9,168,11],[148,6,148,11],[149,2,153,3],[149,4,149,5],[149,6,153,11],[150,4,150,5],[151,4,151,5],[152,4,152,5],[153,4,153,5],[143,6,146,8],[143,9,146,11],[144,0,144,1],[144,2,144,3],[144,4,144,5],[145,0,145,1],[145,2,145,3],[169,0,170,2],[169,3,169,5],[169,6,169,8],[170,3,170,5],[170,6,170,8],[172,0,172,2],[172,3,172,5],[172,6,172,8],[164,0,165,2],[164,7,165,9],[172,9,172,11],[173,0,173,2],[173,3,173,5],[173,6,173,8],[173,9,173,11],[174,0,174,1],[174,2,174,3],[174,4,174,5],[174,6,174,8],[174,9,174,11],[200,0,201,2],[200,9,201,11],[181,6,181,11],[182,2,186,3],[182,4,182,5],[182,6,186,11],[183,4,183,5],[184,4,184,5],[185,4,185,5],[186,4,186,5],[197,0,198,2],[197,7,198,9],[181,0,181,1],[181,2,181,5],[176,0,176,1],[176,2,176,3],[176,4,176,5],[197,10,198,11],[199,0,199,2],[176,6,179,8],[176,9,179,11],[177,0,177,1],[177,2,177,3],[177,4,177,5],[178,0,178,1],[178,2,178,3],[178,4,178,5],[179,0,179,1],[179,2,179,3],[179,4,179,5],[211,4,211,5],[212,0,212,1],[212,2,212,3],[212,4,212,5],[202,0,203,2],[202,3,202,5],[202,6,202,8],[203,3,203,5],[203,6,203,8],[205,0,205,2],[205,3,205,5],[205,6,205,8],[205,9,205,11],[206,0,206,2],[206,3,206,5],[206,6,206,8],[206,9,206,11],[207,0,207,1],[207,2,207,3],[207,4,207,5],[207,6,207,8],[207,9,207,11],[214,0,214,1],[214,2,214,5],[209,0,209,1],[209,2,209,3],[209,4,209,5],[230,10,231,11],[232,0,232,2],[233,0,234,2],[233,9,234,11],[214,6,214,11],[215,2,219,3],[215,4,215,5],[215,6,219,11],[216,4,216,5],[217,4,217,5],[218,4,218,5],[219,4,219,5],[209,6,212,8],[209,9,212,11],[210,0,210,1],[210,2,210,3],[210,4,210,5],[211,0,211,1],[211,2,211,3],[235,0,236,2],[235,3,235,5],[235,6,235,8],[236,3,236,5],[236,6,236,8],[238,0,238,2],[238,3,238,5],[238,6,238,8],[230,0,231,2],[230,7,231,9],[238,9,238,11],[239,0,239,2],[239,3,239,5],[239,6,239,8],[239,9,239,11],[240,0,240,1],[240,2,240,3],[240,4,240,5],[240,6,240,8],[240,9,240,11],[266,0,267,2],[266,9,267,11],[247,6,247,11],[248,2,252,3],[248,4,248,5],[248,6,252,11],[249,4,249,5],[250,4,250,5],[251,4,251,5],[252,4,252,5],[263,0,264,2],[263,7,264,9],[247,0,247,1],[247,2,247,5],[242,0,242,1],[242,2,242,3],[242,4,242,5],[263,10,264,11],[265,0,265,2],[242,6,245,8],[242,9,245,11],[243,0,243,1],[243,2,243,3],[243,4,243,5],[244,0,244,1],[244,2,244,3],[244,4,244,5],[245,0,245,1],[245,2,245,3],[245,4,245,5],[277,4,277,5],[278,0,278,1],[278,2,278,3],[278,4,278,5],[268,0,269,2],[268,3,268,5],[268,6,268,8],[269,3,269,5],[269,6,269,8],[271,0,271,2],[271,3,271,5],[271,6,271,8],[271,9,271,11],[272,0,272,2],[272,3,272,5],[272,6,272,8],[272,9,272,11],[273,0,273,1],[273,2,273,3],[273,4,273,5],[273,6,273,8],[273,9,273,11],[280,0,280,1],[280,2,280,5],[275,0,275,1],[275,2,275,3],[275,4,275,5],[296,10,297,11],[298,0,298,2],[299,0,300,2],[299,9,300,11],[280,6,280,11],[281,2,285,3],[281,4,281,5],[281,6,285,11],[282,4,282,5],[283,4,283,5],[284,4,284,5],[285,4,285,5],[275,6,278,8],[275,9,278,11],[276,0,276,1],[276,2,276,3],[276,4,276,5],[277,0,277,1],[277,2,277,3],[301,0,302,2],[301,3,301,5],[301,6,301,8],[302,3,302,5],[302,6,302,8],[304,0,304,2],[304,3,304,5],[304,6,304,8],[296,0,297,2],[296,7,297,9],[304,9,304,11],[305,0,305,2],[305,3,305,5],[305,6,305,8],[305,9,305,11],[306,0,306,1],[306,2,306,3],[306,4,306,5],[306,6,306,8],[306,9,306,11],[311,0,311,1],[311,2,311,3],[311,4,311,5],[313,0,313,1],[313,2,313,5],[308,0,308,1],[308,2,308,3],[308,4,308,5],[308,6,311,8],[309,0,309,1],[309,2,309,3],[309,4,309,5],[310,0,310,1],[310,2,310,3],[313,6,313,11],[314,2,318,3],[314,4,314,5],[314,6,318,11],[315,4,315,5],[316,4,316,5],[317,4,317,5],[318,4,318,5],[310,4,310,5],[308,9,311,11]]}
["Cliente",null,null,null,null,null,null,"Informe trimestral",null,null,{"$f":"+'EOT2 Asis '!K1:L2","v":"abr - jun"}]
[]
[{"$f":"+Calendar!A5","v":"Rainbow Inc"}]
["Estudiante",null,null,null,null,null,null,null,null,"Horario"]
[]
[{"$f":"+Calendar!B42","v":"Rod"},null,null,"Grupo / nivel",null,null,"Profesor",null,null,"Dias",{"$f":"+Calendar!AI12","v":"Martes"},{"$f":"+Calendar!AI14","v":"Jueves"}]
[null,null,null,{"$f":"+Calendar!Q5","v":"E1 - A1-1 Basico"},null,null,{"$f":"+Calendar!AI21","v":"Chris"},null,null,"Hora",{"$f":"+Calendar!AI17","v":"16:30:00"},{"$f":"+Calendar!AI18","v":"18:30:00"}]
[]
["Objectivo Hablar",null,null,"Objectivo Escribir",null,null,"Objectivo Escuchar",null,null,"Objectivo Leer"]
[{"$f":"+'Obj2'!A10","v":5},null,null,{"$f":"+'Obj2'!D10","v":6},null,null,{"$f":"+'Obj2'!G10","v":7},null,null,{"$f":"+'Obj2'!J10","v":8}]
["Capacidades",null,"Puntuación %",null,"Objetivos alcanzados",null,"Puntos Fuertes",null,null,"Puntos Debíles"]
[]
["Hablar",null,0.9,null,"Si o No",null,"•\n•\n•",null,null,"•\n•\n•"]
["Escribir",null,0.1,null,"Si o No"]
["Escuchar",null,0.9,null,"Si o No"]
["Leer",null,0.8,null,"Si o No"]
[]
["Asistencia",null,null,null,null,null,"Comentarios"]
[{"$f":"+abrF!$K$1","v":"2019-04-01"},{"$f":"+'EOT2 Asis '!C41","v":0},{"$f":"SUM(C13:D16)/4","v":0.67500000000000004},null,"Excelente"]
[{"$f":"mayF!$K$1","v":"2019-05-01"},{"$f":"+'EOT2 Asis '!C42","v":0},null,null,"Muy Bueno"]
[{"$f":"junF!$K$1","v":"2019-06-01"},{"$f":"+'EOT2 Asis '!C43","v":0},null,null,"Bueno"]
[{"$f":"julF!$K$1","v":"2019-07-01"},{"$f":"+'EOT2 Asis '!C44","v":0},null,null,"Satisfactaria"]
["Total",{"$f":"+'EOT2 Asis '!L12","v":0}]
[]
[]
[]
[]
[]
[]
[]
[]
[]
["Cliente",null,null,null,null,null,null,"Informe trimestral",null,null,{"$f":"+$K$1","v":"abr - jun"}]
[]
[{"$f":"+$A$3","v":"Rainbow Inc"}]
["Estudiante",null,null,null,null,null,null,null,null,"Horario"]
[]
[{"$f":"+Calendar!B43","v":"Jane"},null,null,"Grupo / nivel",null,null,"Profesor",null,null,"Dias",{"$f":"+$K$6","v":"Martes"},{"$f":"+$L$6","v":"Jueves"}]
[null,null,null,{"$f":"+$D$7","v":"E1 - A1-1 Basico"},null,null,{"$f":"+$G$7","v":"Chris"},null,null,"Hora",{"$f":"+$K$7","v":"16:30:00"},{"$f":"+$L$7","v":"18:30:00"}]
[]
["Objectivo Hablar",null,null,"Objectivo Escribir",null,null,"Objectivo Escuchar",null,null,"Objectivo Leer"]
[{"$f":"+$A$10","v":5},null,null,{"$f":"+$D$10","v":6},null,null,{"$f":"+$G$10","v":7},null,null,{"$f":"+$J$10","v":8}]
["Capacidades",null,"Puntuación %",null,"Objetivos alcanzados",null,"Puntos Fuertes",null,null,"Puntos Debíles"]
[]
["Hablar",null,0.2,null,"Si o No",null,"•\n•\n•",null,null,"•\n•\n•"]
["Escribir",null,0.7,null,"Si o No"]
["Escuchar",null,0.7,null,"Si o No"]
["Leer",null,0.8,null,"Si o No"]
[]
["Asistencia",null,null,null,null,null,"Comentarios"]
[{"$f":"+$A$19","v":"2019-04-01"},{"$f":"+'EOT2 Asis '!D41","v":0},{"$f":"SUM(C45:D48)/4","v":0.6},null,"Excelente"]
[{"$f":"+$A$20","v":"2019-05-01"},{"$f":"+'EOT2 Asis '!D42","v":0},null,null,"Muy Bueno"]
[{"$f":"+$A$21","v":"2019-06-01"},{"$f":"+'EOT2 Asis '!D43","v":0},null,null,"Bueno"]
[{"$f":"+$A$22","v":"2019-07-01"},{"$f":"+'EOT2 Asis '!D44","v":0},null,null,"Satisfactaria"]
["Total",{"$f":"+'EOT2 Asis '!L13","v":0}]
[]
[]
[]
[]
[]
[]
[]
[]
[]
[]
["Cliente",null,null,null,null,null,null,"Informe trimestral",null,null,{"$f":"+$K$1","v":"abr - jun"}]
[]
[{"$f":"+$A$3","v":"Rainbow Inc"}]
["Estudiante",null,null,null,null,null,null,null,null,"Horario"]
[]
[{"$f":"+Calendar!B44","v":"Freddy"},null,null,"Grupo / nivel",null,null,"Profesor",null,null,"Dias",{"$f":"+$K$6","v":"Martes"},{"$f":"+$L$6","v":"Jueves"}]
[null,null,null,{"$f":"+$D$7","v":"E1 - A1-1 Basico"},null,null,{"$f":"+$G$7","v":"Chris"},null,null,"Hora",{"$f":"+$K$7","v":"16:30:00"},{"$f":"+$L$7","v":"18:30:00"}]
[]
["Objectivo Hablar",null,null,"Objectivo Escribir",null,null,"Objectivo Escuchar",null,null,"Objectivo Leer"]
[{"$f":"+$A$10","v":5},null,null,{"$f":"+$D$10","v":6},null,null,{"$f":"+$G$10","v":7},null,null,{"$f":"+$J$10","v":8}]
["Capacidades",null,"Puntuación %",null,"Objetivos alcanzados",null,"Puntos Fuertes",null,null,"Puntos Debíles"]
[]
["Hablar",null,0.9,null,"Si o No",null,"•\n•\n•",null,null,"•\n•\n•"]
["Escribir",null,0.1,null,"Si o No"]
["Escuchar",null,0.9,null,"Si o No"]
["Leer",null,0.8,null,"Si o No"]
[]
["Asistencia",null,null,null,null,null,"Comentarios"]
[{"$f":"+$A$19","v":"2019-04-01"},{"$f":"+'EOT2 Asis '!E41","v":0},{"$f":"SUM(C78:D81)/4","v":0.67500000000000004},null,"Excelente"]
[{"$f":"+$A$20","v":"2019-05-01"},{"$f":"+'EOT2 Asis '!E42","v":0},null,null,"Muy Bueno"]
[{"$f":"+$A$21","v":"2019-06-01"},{"$f":"+'EOT2 Asis '!E43","v":0},null,null,"Bueno"]
[{"$f":"+$A$22","v":"2019-07-01"},{"$f":"+'EOT2 Asis '!E44","v":0},null,null,"Satisfactaria"]
["Total",{"$f":"+'EOT2 Asis '!L14","v":0}]
[]
[]
[]
[]
[]
[]
[]
[]
[]
[]
["Cliente",null,null,null,null,null,null,"Informe trimestral",null,null,{"$f":"+$K$1","v":"abr - jun"}]
[]
[{"$f":"+$A$3","v":"Rainbow Inc"}]
["Estudiante",null,null,null,null,null,null,null,null,"Horario"]
[]
[{"$f":"+Calendar!B45","v":"George"},null,null,"Grupo / nivel",null,null,"Profesor",null,null,"Dias",{"$f":"+$K$6","v":"Martes"},{"$f":"+$L$6","v":"Jueves"}]
[null,null,null,{"$f":"+$D$7","v":"E1 - A1-1 Basico"},null,null,{"$f":"+$G$7","v":"Chris"},null,null,"Hora",{"$f":"+$K$7","v":"16:30:00"},{"$f":"+$L$7","v":"18:30:00"}]
[]
["Objectivo Hablar",null,null,"Objectivo Escribir",null,null,"Objectivo Escuchar",null,null,"Objectivo Leer"]
[{"$f":"+$A$10","v":5},null,null,{"$f":"+$D$10","v":6},null,null,{"$f":"+$G$10","v":7},null,null,{"$f":"+$J$10","v":8}]
["Capacidades",null,"Puntuación %",null,"Objetivos alcanzados",null,"Puntos Fuertes",null,null,"Puntos Debíles"]
[]
["Hablar",null,0.9,null,"Si o No",null,"•\n•\n•",null,null,"•\n•\n•"]
["Escribir",null,0.1,null,"Si o No"]
["Escuchar",null,0.9,null,"Si o No"]
["Leer",null,0.8,null,"Si o No"]
[]
["Asistencia",null,null,null,null,null,"Comentarios"]
[{"$f":"+$A$19","v":"2019-04-01"},{"$f":"+'EOT2 Asis '!F41","v":0},{"$f":"SUM(C111:D114)/4","v":0.67500000000000004},null,"Excelente"]
[{"$f":"+$A$20","v":"2019-05-01"},{"$f":"+'EOT2 Asis '!F42","v":0},null,null,"Muy Bueno"]
[{"$f":"+$A$21","v":"2019-06-01"},{"$f":"+'EOT2 Asis '!F43","v":0},null,null,"Bueno"]
[{"$f":"+$A$22","v":"2019-07-01"},{"$f":"+'EOT2 Asis '!F44","v":0},null,null,"Satisfactaria"]
["Total",{"$f":"+'EOT2 Asis '!L14","v":0}]
[]
[]
[]
[]
[]
[]
[]
[]
[]
[]
["Cliente",null,null,null,null,null,null,"Informe trimestral",null,null,{"$f":"+$K$1","v":"abr - jun"}]
[]
[{"$f":"+$A$3","v":"Rainbow Inc"}]
["Estudiante",null,null,null,null,null,null,null,null,"Horario"]
[]
[{"$f":"+Calendar!B46","v":"Bungle"},null,null,"Grupo / nivel",null,null,"Profesor",null,null,"Dias",{"$f":"+$K$6","v":"Martes"},{"$f":"+$L$6","v":"Jueves"}]
[null,null,null,{"$f":"+$D$7","v":"E1 - A1-1 Basico"},null,null,{"$f":"+$G$7","v":"Chris"},null,null,"Hora",{"$f":"+$K$7","v":"16:30:00"},{"$f":"+$L$7","v":"18:30:00"}]
[]
["Objectivo Hablar",null,null,"Objectivo Escribir",null,null,"Objectivo Escuchar",null,null,"Objectivo Leer"]
[{"$f":"+$A$10","v":5},null,null,{"$f":"+$D$10","v":6},null,null,{"$f":"+$G$10","v":7},null,null,{"$f":"+$J$10","v":8}]
["Capacidades",null,"Puntuación %",null,"Objetivos alcanzados",null,"Puntos Fuertes",null,null,"Puntos Debíles"]
[]
["Hablar",null,0.9,null,"Si o No",null,"•\n•\n•",null,null,"•\n•\n•"]
["Escribir",null,0.1,null,"Si o No"]
["Escuchar",null,0.9,null,"Si o No"]
["Leer",null,0.8,null,"Si o No"]
[]
["Asistencia",null,null,null,null,null,"Comentarios"]
[{"$f":"+$A$19","v":"2019-04-01"},{"$f":"+'EOT2 Asis '!G41","v":0},{"$f":"SUM(C144:D147)/4","v":0.67500000000000004},null,"Excelente"]
[{"$f":"+$A$20","v":"2019-05-01"},{"$f":"+'EOT2 Asis '!G42","v":0},null,null,"Muy Bueno"]
[{"$f":"+$A$21","v":"2019-06-01"},{"$f":"+'EOT2 Asis '!G43","v":0},null,null,"Bueno"]
[{"$f":"+$A$22","v":"2019-07-01"},{"$f":"+'EOT2 Asis '!G44","v":0},null,null,"Satisfactaria"]
["Total",{"$f":"+'EOT2 Asis '!L16","v":0}]
[]
[]
[]
[]
[]
[]
[]
[]
[]
[]
["Cliente",null,null,null,null,null,null,"Informe trimestral",null,null,{"$f":"+$K$1","v":"abr - jun"}]
[]
[{"$f":"+$A$3","v":"Rainbow Inc"}]
["Estudiante",null,null,null,null,null,null,null,null,"Horario"]
[]
[{"$f":"+Calendar!B47","v":"Zippy"},null,null,"Grupo / nivel",null,null,"Profesor",null,null,"Dias",{"$f":"+$K$6","v":"Martes"},{"$f":"+$L$6","v":"Jueves"}]
[null,null,null,{"$f":"+$D$7","v":"E1 - A1-1 Basico"},null,null,{"$f":"+$G$7","v":"Chris"},null,null,"Hora",{"$f":"+$K$7","v":"16:30:00"},{"$f":"+$L$7","v":"18:30:00"}]
[]
["Objectivo Hablar",null,null,"Objectivo Escribir",null,null,"Objectivo Escuchar",null,null,"Objectivo Leer"]
[{"$f":"+$A$10","v":5},null,null,{"$f":"+$D$10","v":6},null,null,{"$f":"+$G$10","v":7},null,null,{"$f":"+$J$10","v":8}]
["Capacidades",null,"Puntuación %",null,"Objetivos alcanzados",null,"Puntos Fuertes",null,null,"Puntos Debíles"]
[]
["Hablar",null,0.9,null,"Si o No",null,"•\n•\n•",null,null,"•\n•\n•"]
["Escribir",null,0.1,null,"Si o No"]
["Escuchar",null,0.9,null,"Si o No"]
["Leer",null,0.8,null,"Si o No"]
[]
["Asistencia",null,null,null,null,null,"Comentarios"]
[{"$f":"+$A$19","v":"2019-04-01"},{"$f":"+'EOT2 Asis '!H41","v":0},{"$f":"SUM(C177:D180)/4","v":0.67500000000000004},null,"Excelente"]
[{"$f":"+$A$20","v":"2019-05-01"},{"$f":"+'EOT2 Asis '!H42","v":0},null,null,"Muy Bueno"]
[{"$f":"+$A$21","v":"2019-06-01"},{"$f":"+'EOT2 Asis '!H43","v":0},null,null,"Bueno"]
[{"$f":"+$A$22","v":"2019-07-01"},{"$f":"+'EOT2 Asis '!H44","v":0},null,null,"Satisfactaria"]
["Total",{"$f":"+'EOT2 Asis '!L17","v":0}]
[]
[]
[]
[]
[]
[]
[]
[]
[]
[]
["Cliente",null,null,null,null,null,null,"Informe trimestral",null,null,{"$f":"+$K$1","v":"abr - jun"}]
[]
[{"$f":"+$A$3","v":"Rainbow Inc"}]
["Estudiante",null,null,null,null,null,null,null,null,"Horario"]
[]
[{"$f":"+Calendar!B48","v":"Mathew"},null,null,"Grupo / nivel",null,null,"Profesor",null,null,"Dias",{"$f":"+$K$6","v":"Martes"},{"$f":"+$L$6","v":"Jueves"}]
[null,null,null,{"$f":"+$D$7","v":"E1 - A1-1 Basico"},null,null,{"$f":"+$G$7","v":"Chris"},null,null,"Hora",{"$f":"+$K$7","v":"16:30:00"},{"$f":"+$L$7","v":"18:30:00"}]
[]
["Objectivo Hablar",null,null,"Objectivo Escribir",null,null,"Objectivo Escuchar",null,null,"Objectivo Leer"]
[{"$f":"+$A$10","v":5},null,null,{"$f":"+$D$10","v":6},null,null,{"$f":"+$G$10","v":7},null,null,{"$f":"+$J$10","v":8}]
["Capacidades",null,"Puntuación %",null,"Objetivos alcanzados",null,"Puntos Fuertes",null,null,"Puntos Debíles"]
[]
["Hablar",null,0.9,null,"Si o No",null,"•\n•\n•",null,null,"•\n•\n•"]
["Escribir",null,0.1,null,"Si o No"]
["Escuchar",null,0.9,null,"Si o No"]
["Leer",null,0.8,null,"Si o No"]
[]
["Asistencia",null,null,null,null,null,"Comentarios"]
[{"$f":"+$A$19","v":"2019-04-01"},{"$f":"+'EOT2 Asis '!I41","v":0},{"$f":"SUM(C210:D213)/4","v":0.67500000000000004},null,"Excelente"]
[{"$f":"+$A$20","v":"2019-05-01"},{"$f":"+'EOT2 Asis '!I42","v":0},null,null,"Muy Bueno"]
[{"$f":"+$A$21","v":"2019-06-01"},{"$f":"+'EOT2 Asis '!I43","v":0},null,null,"Bueno"]
[{"$f":"+$A$22","v":"2019-07-01"},{"$f":"+'EOT2 Asis '!I44","v":0},null,null,"Satisfactaria"]
["Total",{"$f":"+'EOT2 Asis '!L18","v":0}]
[]
[]
[]
[]
[]
[]
[]
[]
[]
[]
["Cliente",null,null,null,null,null,null,"Informe trimestral",null,null,{"$f":"+$K$1","v":"abr - jun"}]
[]
[{"$f":"+$A$3","v":"Rainbow Inc"}]
["Estudiante",null,null,null,null,null,null,null,null,"Horario"]
[]
[{"$f":"+Calendar!B49","v":"Sooty"},null,null,"Grupo / nivel",null,null,"Profesor",null,null,"Dias",{"$f":"+$K$6","v":"Martes"},{"$f":"+$L$6","v":"Jueves"}]
[null,null,null,{"$f":"+$D$7","v":"E1 - A1-1 Basico"},null,null,{"$f":"+$G$7","v":"Chris"},null,null,"Hora",{"$f":"+$K$7","v":"16:30:00"},{"$f":"+$L$7","v":"18:30:00"}]
[]
["Objectivo Hablar",null,null,"Objectivo Escribir",null,null,"Objectivo Escuchar",null,null,"Objectivo Leer"]
[{"$f":"+$A$10","v":5},null,null,{"$f":"+$D$10","v":6},null,null,{"$f":"+$G$10","v":7},null,null,{"$f":"+$J$10","v":8}]
["Capacidades",null,"Puntuación %",null,"Objetivos alcanzados",null,"Puntos Fuertes",null,null,"Puntos Debíles"]
[]
["Hablar",null,0.9,null,"Si o No",null,"•\n•\n•",null,null,"•\n•\n•"]
["Escribir",null,0.1,null,"Si o No"]
["Escuchar",null,0.9,null,"Si o No"]
["Leer",null,0.8,null,"Si o No"]
[]
["Asistencia",null,null,null,null,null,"Comentarios"]
[{"$f":"+$A$19","v":"2019-04-01"},{"$f":"+'EOT2 Asis '!J41","v":0},{"$f":"SUM(C243:D246)/4","v":0.67500000000000004},null,"Excelente"]
[{"$f":"+$A$20","v":"2019-05-01"},{"$f":"+'EOT2 Asis '!J42","v":0},null,null,"Muy Bueno"]
[{"$f":"+$A$21","v":"2019-06-01"},{"$f":"+'EOT2 Asis '!J43","v":0},null,null,"Bueno"]
[{"$f":"+$A$22","v":"2019-07-01"},{"$f":"+'EOT2 Asis '!J44","v":0},null,null,"Satisfactaria"]
["Total",{"$f":"+'EOT2 Asis '!L19","v":0}]
[]
[]
[]
[]
[]
[]
[]
[]
[]
[]
["Cliente",null,null,null,null,null,null,"Informe trimestral",null,null,{"$f":"+$K$1","v":"abr - jun"}]
[]
[{"$f":"+$A$3","v":"Rainbow Inc"}]
["Estudiante",null,null,null,null,null,null,null,null,"Horario"]
[]
[{"$f":"+Calendar!B50","v":"Sweep"},null,null,"Grupo / nivel",null,null,"Profesor",null,null,"Dias",{"$f":"+$K$6","v":"Martes"},{"$f":"+$L$6","v":"Jueves"}]
[null,null,null,{"$f":"+$D$7","v":"E1 - A1-1 Basico"},null,null,{"$f":"+$G$7","v":"Chris"},null,null,"Hora",{"$f":"+$K$7","v":"16:30:00"},{"$f":"+$L$7","v":"18:30:00"}]
[]
["Objectivo Hablar",null,null,"Objectivo Escribir",null,null,"Objectivo Escuchar",null,null,"Objectivo Leer"]
[{"$f":"+$A$10","v":5},null,null,{"$f":"+$D$10","v":6},null,null,{"$f":"+$G$10","v":7},null,null,{"$f":"+$J$10","v":8}]
["Capacidades",null,"Puntuación %",null,"Objetivos alcanzados",null,"Puntos Fuertes",null,null,"Puntos Debíles"]
[]
["Hablar",null,0.9,null,"Si o No",null,"•\n•\n•",null,null,"•\n•\n•"]
["Escribir",null,0.1,null,"Si o No"]
["Escuchar",null,0.9,null,"Si o No"]
["Leer",null,0.8,null,"Si o No"]
[]
["Asistencia",null,null,null,null,null,"Comentarios"]
[{"$f":"+$A$19","v":"2019-04-01"},{"$f":"+'EOT2 Asis '!K41","v":0},{"$f":"SUM(C276:D279)/4","v":0.67500000000000004},null,"Excelente"]
[{"$f":"+$A$20","v":"2019-05-01"},{"$f":"+'EOT2 Asis '!K42","v":0},null,null,"Muy Bueno"]
[{"$f":"+$A$21","v":"2019-06-01"},{"$f":"+'EOT2 Asis '!K43","v":0},null,null,"Bueno"]
[{"$f":"+$A$22","v":"2019-07-01"},{"$f":"+'EOT2 Asis '!K44","v":0},null,null,"Satisfactaria"]
["Total",{"$f":"+'EOT2 Asis '!L20","v":0}]
[]
[]
[]
[]
[]
[]
[]
[]
[]
[]
["Cliente",null,null,null,null,null,null,"Informe trimestral",null,null,{"$f":"+$K$1","v":"abr - jun"}]
[]
[{"$f":"+$A$3","v":"Rainbow Inc"}]
["Estudiante",null,null,null,null,null,null,null,null,"Horario"]
[]
[{"$f":"+Calendar!B51","v":"Sue"},null,null,"Grupo / nivel",null,null,"Profesor",null,null,"Dias",{"$f":"+$K$6","v":"Martes"},{"$f":"+$L$6","v":"Jueves"}]
[null,null,null,{"$f":"+$D$7","v":"E1 - A1-1 Basico"},null,null,{"$f":"+$G$7","v":"Chris"},null,null,"Hora",{"$f":"+$K$7","v":"16:30:00"},{"$f":"+$L$7","v":"18:30:00"}]
[]
["Objectivo Hablar",null,null,"Objectivo Escribir",null,null,"Objectivo Escuchar",null,null,"Objectivo Leer"]
[{"$f":"+$A$10","v":5},null,null,{"$f":"+$D$10","v":6},null,null,{"$f":"+$G$10","v":7},null,null,{"$f":"+$J$10","v":8}]
["Capacidades",null,"Puntuación %",null,"Objetivos alcanzados",null,"Puntos Fuertes",null,null,"Puntos Debíles"]
[]
["Hablar",null,0.9,null,"Si o No",null,"•\n•\n•",null,null,"•\n•\n•"]
["Escribir",null,0.1,null,"Si o No"]
["Escuchar",null,0.9,null,"Si o No"]
["Leer",null,0.8,null,"Si o No"]
[]
["Asistencia",null,null,null,null,null,"Comentarios"]
[{"$f":"+$A$19","v":"2019-04-01"},{"$f":"+'EOT2 Asis '!L41","v":0},{"$f":"SUM(C309:D312)/4","v":0.67500000000000004},null,"Excelente"]
[{"$f":"+$A$20","v":"2019-05-01"},{"$f":"+'EOT2 Asis '!L42","v":0},null,null,"Muy Bueno"]
[{"$f":"+$A$21","v":"2019-06-01"},{"$f":"+'EOT2 Asis '!L43","v":0},null,null,"Bueno"]
[{"$f":"+$A$22","v":"2019-07-01"},{"$f":"+'EOT2 Asis '!L44","v":0},null,null,"Satisfactaria"]
["Total",{"$f":"+'EOT2 Asis '!L21","v":0}]

{"sheet":"Obj3","index":13,"n_rows":10,"n_cols":12,"rows_kept":10,"cut":false,"hidden":true,"merged":[[0,0,1,2],[0,7,1,9],[0,10,1,11],[2,0,2,2],[3,0,4,2],[3,9,4,11],[5,0,5,2],[5,3,5,5],[5,6,5,8],[6,0,6,2],[6,3,6,5],[6,6,6,8],[8,0,8,2],[8,3,8,5],[8,6,8,8],[8,9,8,11],[9,0,11,2],[9,3,11,5],[9,6,11,8],[9,9,11,11]]}
["Cliente",null,null,null,null,null,null,"Trimestre ",null,null,"sep - dic"]
[]
[{"$f":"+Calendar!A5","v":"Rainbow Inc"}]
["Dirección",null,null,null,null,null,null,null,null,"Horario"]
[]
[{"$f":"+Calendar!AI2","v":"Toy street 1"},null,null,"Grupo / nivel",null,null,"Profesor",null,null,"Dias",{"$f":"+Calendar!AI12","v":"Martes"},{"$f":"+Calendar!AI14","v":"Jueves"}]
[{"$f":"+Calendar!AI3","v":"Barcelona"},null,null,{"$f":"+Calendar!Q5","v":"E1 - A1-1 Basico"},null,null,{"$f":"+Calendar!AI21","v":"Chris"},null,null,"Hora",{"$f":"+Calendar!AI17","v":"16:30:00"},{"$f":"+Calendar!AI18","v":"18:30:00"}]
[]
["Objectivo Hablar",null,null,"Objectivo Escribir",null,null,"Objectivo Escuchar",null,null,"Objectivo Leer"]
[9,null,null,10,null,null,11,null,null,12]

{"sheet":"sep","index":14,"n_rows":78,"n_cols":12,"rows_kept":78,"cut":false,"hidden":true,"merged":[[5,0,5,2],[5,3,5,5],[5,6,5,8],[6,0,6,2],[6,3,6,5],[6,6,6,8],[0,0,1,2],[0,9,1,9],[0,10,1,11],[2,0,2,2],[3,0,4,2],[3,9,4,11],[12,1,12,3],[12,4,12,6],[12,7,12,11],[13,1,13,3],[13,4,13,6],[13,7,13,11],[8,1,9,3],[8,4,9,6],[8,7,9,11],[10,1,10,3],[10,4,10,6],[10,7,11,11],[11,1,11,3],[11,4,11,6],[19,1,19,3],[19,4,19,6],[19,7,19,11],[20,1,20,3],[20,4,20,6],[20,7,20,11],[15,1,16,3],[15,4,16,6],[15,7,16,11],[17,1,17,3],[17,4,17,6],[17,7,18,11],[18,1,18,3],[18,4,18,6],[26,1,26,3],[26,4,26,6],[26,7,26,11],[27,1,27,3],[27,4,27,6],[27,7,27,11],[22,1,23,3],[22,4,23,6],[22,7,23,11],[24,1,24,3],[24,4,24,6],[24,7,25,11],[25,1,25,3],[25,4,25,6],[33,1,33,3],[33,4,33,6],[33,7,33,11],[34,1,34,3],[34,4,34,6],[34,7,34,11],[29,1,30,3],[29,4,30,6],[29,7,30,11],[31,1,31,3],[31,4,31,6],[31,7,32,11],[32,1,32,3],[32,4,32,6],[40,1,40,3],[40,4,40,6],[40,7,40,11],[41,1,41,3],[41,4,41,6],[41,7,41,11],[36,1,37,3],[36,4,37,6],[36,7,37,11],[38,1,38,3],[38,4,38,6],[38,7,39,11],[39,1,39,3],[39,4,39,6],[47,1,47,3],[47,4,47,6],[47,7,47,11],[48,1,48,3],[48,4,48,6],[48,7,48,11],[43,1,44,3],[43,4,44,6],[43,7,44,11],[45,1,45,3],[45,4,45,6],[45,7,46,11],[46,1,46,3],[46,4,46,6],[54,1,54,3],[54,4,54,6],[54,7,54,11],[55,1,55,3],[55,4,55,6],[55,7,55,11],[50,1,51,3],[50,4,51,6],[50,7,51,11],[52,1,52,3],[52,4,52,6],[52,7,53,11],[53,1,53,3],[53,4,53,6],[62,1,62,3],[62,4,62,6],[62,7,62,11],[63,1,63,3],[63,4,63,6],[63,7,63,11],[58,1,59,3],[58,4,59,6],[58,7,59,11],[60,1,60,3],[60,4,60,6],[60,7,61,11],[61,1,61,3],[61,4,61,6],[69,1,69,3],[69,4,69,6],[69,7,69,11],[70,1,70,3],[70,4,70,6],[70,7,70,11],[65,1,66,3],[65,4,66,6],[65,7,66,11],[67,1,67,3],[67,4,67,6],[67,7,68,11],[68,1,68,3],[68,4,68,6],[76,1,76,3],[76,4,76,6],[76,7,76,11],[77,1,77,3],[77,4,77,6],[77,7,77,11],[72,1,73,3],[72,4,73,6],[72,7,73,11],[74,1,74,3],[74,4,74,6],[74,7,75,11],[75,1,75,3],[75,4,75,6]]}
["Cliente",null,null,null,null,null,null,null,null,"Mes",{"$f":"+sepF!K1","v":"2019-09-01"}]
[]
[{"$f":"+Calendar!A5","v":"Rainbow Inc"}]
["Libros",null,null,null,null,null,null,null,null,"Horario"]
[]
[null,null,null,"Grupo / nivel",null,null,"Profesor",null,null,"Dias",{"$f":"+Calendar!AI12","v":"Martes"},{"$f":"+Calendar!AI14","v":"Jueves"}]
[null,null,null,{"$f":"+Calendar!Q5","v":"E1 - A1-1 Basico"},null,null,{"$f":"+Calendar!AI21","v":"Chris"},null,null,"Hora",{"$f":"+Calendar!AI17","v":"16:30:00"},{"$f":"+Calendar!AI18","v":"18:30:00"}]
[]
["Date","Material",null,null,"Content",null,null,"Aim"]
[{"$f":"+sepF!C9","v":"2019-09-03"}]
["Speaking"]
["Writing"]
["Listening",null,null,null,null,null,null,"Comments"]
["Reading"]
[]
["Date","Material",null,null,"Content",null,null,"Aim"]
[{"$f":"+sepF!D9","v":"2019-09-05"},"Coursebook"]
["Speaking"]
["Writing"]
["Listening",null,null,null,null,null,null,"Comments"]
["Reading"]
[]
["Date","Material",null,null,"Content",null,null,"Aim"]
[{"$f":"+sepF!E9","v":"2019-09-10"},"Coursebook"]
["Speaking"]
["Writing"]
["Listening",null,null,null,null,null,null,"Comments"]
["Reading"]
[]
["Date","Material",null,null,"Content",null,null,"Aim"]
[{"$f":"+sepF!F9","v":"2019-09-12"},"Coursebook"]
["Speaking"]
["Writing"]
["Listening",null,null,null,null,null,null,"Comments"]
["Reading"]
[]
["Date","Material",null,null,"Content",null,null,"Aim"]
[{"$f":"+sepF!G9","v":"2019-09-17"},"Coursebook"]
["Speaking"]
["Writing"]
["Listening",null,null,null,null,null,null,"Comments"]
["Reading"]
[]
["Date","Material",null,null,"Content",null,null,"Aim"]
[{"$f":"+sepF!H9","v":"2019-09-19"},"Coursebook"]
["Speaking"]
["Writing"]
["Listening",null,null,null,null,null,null,"Comments"]
["Reading"]
[]
["Date","Material",null,null,"Content",null,null,"Aim"]
[{"$f":"+sepF!I9","v":"2019-09-24"},"Coursebook"]
["Speaking"]
["Writing"]
["Listening",null,null,null,null,null,null,"Comments"]
["Reading"]
[]
[]
["Date","Material",null,null,"Content",null,null,"Aim"]
[{"$f":"+sepF!J9","v":"2019-09-26"},"Coursebook"]
["Speaking"]
["Writing"]
["Listening",null,null,null,null,null,null,"Comments"]
["Reading"]
[]
["Date","Material",null,null,"Content",null,null,"Aim"]
[{"$f":"+sepF!K9","v":""},"Coursebook"]
["Speaking"]
["Writing"]
["Listening",null,null,null,null,null,null,"Comments"]
["Reading"]
[]
["Date","Material",null,null,"Content",null,null,"Aim"]
[{"$f":"+sepF!L9","v":""},"Coursebook"]
["Speaking"]
["Writing"]
["Listening",null,null,null,null,null,null,"Comments"]
["Reading"]

{"sheet":"oct","index":15,"n_rows":78,"n_cols":12,"rows_kept":78,"cut":false,"hidden":true,"merged":[[5,0,5,2],[5,3,5,5],[5,6,5,8],[6,0,6,2],[6,3,6,5],[6,6,6,8],[0,0,1,2],[0,9,1,9],[0,10,1,11],[2,0,2,2],[3,0,4,2],[3,9,4,11],[12,1,12,3],[12,4,12,6],[12,7,12,11],[13,1,13,3],[13,4,13,6],[13,7,13,11],[8,1,9,3],[8,4,9,6],[8,7,9,11],[10,1,10,3],[10,4,10,6],[10,7,11,11],[11,1,11,3],[11,4,11,6],[19,1,19,3],[19,4,19,6],[19,7,19,11],[20,1,20,3],[20,4,20,6],[20,7,20,11],[15,1,16,3],[15,4,16,6],[15,7,16,11],[17,1,17,3],[17,4,17,6],[17,7,18,11],[18,1,18,3],[18,4,18,6],[26,1,26,3],[26,4,26,6],[26,7,26,11],[27,1,27,3],[27,4,27,6],[27,7,27,11],[22,1,23,3],[22,4,23,6],[22,7,23,11],[24,1,24,3],[24,4,24,6],[24,7,25,11],[25,1,25,3],[25,4,25,6],[33,1,33,3],[33,4,33,6],[33,7,33,11],[34,1,34,3],[34,4,34,6],[34,7,34,11],[29,1,30,3],[29,4,30,6],[29,7,30,11],[31,1,31,3],[31,4,31,6],[31,7,32,11],[32,1,32,3],[32,4,32,6],[40,1,40,3],[40,4,40,6],[40,7,40,11],[41,1,41,3],[41,4,41,6],[41,7,41,11],[36,1,37,3],[36,4,37,6],[36,7,37,11],[38,1,38,3],[38,4,38,6],[38,7,39,11],[39,1,39,3],[39,4,39,6],[47,1,47,3],[47,4,47,6],[47,7,47,11],[48,1,48,3],[48,4,48,6],[48,7,48,11],[43,1,44,3],[43,4,44,6],[43,7,44,11],[45,1,45,3],[45,4,45,6],[45,7,46,11],[46,1,46,3],[46,4,46,6],[54,1,54,3],[54,4,54,6],[54,7,54,11],[55,1,55,3],[55,4,55,6],[55,7,55,11],[50,1,51,3],[50,4,51,6],[50,7,51,11],[52,1,52,3],[52,4,52,6],[52,7,53,11],[53,1,53,3],[53,4,53,6],[62,1,62,3],[62,4,62,6],[62,7,62,11],[63,1,63,3],[63,4,63,6],[63,7,63,11],[58,1,59,3],[58,4,59,6],[58,7,59,11],[60,1,60,3],[60,4,60,6],[60,7,61,11],[61,1,61,3],[61,4,61,6],[69,1,69,3],[69,4,69,6],[69,7,69,11],[70,1,70,3],[70,4,70,6],[70,7,70,11],[65,1,66,3],[65,4,66,6],[65,7,66,11],[67,1,67,3],[67,4,67,6],[67,7,68,11],[68,1,68,3],[68,4,68,6],[76,1,76,3],[76,4,76,6],[76,7,76,11],[77,1,77,3],[77,4,77,6],[77,7,77,11],[72,1,73,3],[72,4,73,6],[72,7,73,11],[74,1,74,3],[74,4,74,6],[74,7,75,11],[75,1,75,3],[75,4,75,6]]}
["Cliente",null,null,null,null,null,null,null,null,"Mes",{"$f":"+octF!K1","v":"2019-10-01"}]
[]
[{"$f":"+Calendar!A5","v":"Rainbow Inc"}]
["Libros",null,null,null,null,null,null,null,null,"Horario"]
[]
[null,null,null,"Grupo / nivel",null,null,"Profesor",null,null,"Dias",{"$f":"+Calendar!AI12","v":"Martes"},{"$f":"+Calendar!AI14","v":"Jueves"}]
[null,null,null,{"$f":"+Calendar!Q5","v":"E1 - A1-1 Basico"},null,null,{"$f":"+Calendar!AI21","v":"Chris"},null,null,"Hora",{"$f":"+Calendar!AI17","v":"16:30:00"},{"$f":"+Calendar!AI18","v":"18:30:00"}]
[]
["Date","Material",null,null,"Content",null,null,"Aim"]
[{"$f":"+octF!C9","v":"2019-10-01"}]
["Speaking"]
["Writing"]
["Listening",null,null,null,null,null,null,"Comments"]
["Reading"]
[]
["Date","Material",null,null,"Content",null,null,"Aim"]
[{"$f":"+octF!D9","v":"2019-10-03"},"Coursebook"]
["Speaking"]
["Writing"]
["Listening",null,null,null,null,null,null,"Comments"]
["Reading"]
[]
["Date","Material",null,null,"Content",null,null,"Aim"]
[{"$f":"+octF!E9","v":"2019-10-08"},"Coursebook"]
["Speaking"]
["Writing"]
["Listening",null,null,null,null,null,null,"Comments"]
["Reading"]
[]
["Date","Material",null,null,"Content",null,null,"Aim"]
[{"$f":"+octF!F9","v":"2019-10-10"},"Coursebook"]
["Speaking"]
["Writing"]
["Listening",null,null,null,null,null,null,"Comments"]
["Reading"]
[]
["Date","Material",null,null,"Content",null,null,"Aim"]
[{"$f":"+octF!G9","v":"2019-10-15"},"Coursebook"]
["Speaking"]
["Writing"]
["Listening",null,null,null,null,null,null,"Comments"]
["Reading"]
[]
["Date","Material",null,null,"Content",null,null,"Aim"]
[{"$f":"+octF!H9","v":"2019-10-17"},"Coursebook"]
["Speaking"]
["Writing"]
["Listening",null,null,null,null,null,null,"Comments"]
["Reading"]
[]
["Date","Material",null,null,"Content",null,null,"Aim"]
[{"$f":"+octF!I9","v":"2019-10-22"},"Coursebook"]
["Speaking"]
["Writing"]
["Listening",null,null,null,null,null,null,"Comments"]
["Reading"]
[]
[]
["Date","Material",null,null,"Content",null,null,"Aim"]
[{"$f":"+octF!J9","v":"2019-10-24"},"Coursebook"]
["Speaking"]
["Writing"]
["Listening",null,null,null,null,null,null,"Comments"]
["Reading"]
[]
["Date","Material",null,null,"Content",null,null,"Aim"]
[{"$f":"+octF!K9","v":"2019-10-29"},"Coursebook"]
["Speaking"]
["Writing"]
["Listening",null,null,null,null,null,null,"Comments"]
["Reading"]
[]
["Date","Material",null,null,"Content",null,null,"Aim"]
[{"$f":"+octF!L9","v":"2019-10-31"},"Coursebook"]
["Speaking"]
["Writing"]
["Listening",null,null,null,null,null,null,"Comments"]
["Reading"]

{"sheet":"nov","index":16,"n_rows":78,"n_cols":12,"rows_kept":78,"cut":false,"hidden":true,"merged":[[5,0,5,2],[5,3,5,5],[5,6,5,8],[6,0,6,2],[6,3,6,5],[6,6,6,8],[0,0,1,2],[0,9,1,9],[0,10,1,11],[2,0,2,2],[3,0,4,2],[3,9,4,11],[12,1,12,3],[12,4,12,6],[12,7,12,11],[13,1,13,3],[13,4,13,6],[13,7,13,11],[8,1,9,3],[8,4,9,6],[8,7,9,11],[10,1,10,3],[10,4,10,6],[10,7,11,11],[11,1,11,3],[11,4,11,6],[19,1,19,3],[19,4,19,6],[19,7,19,11],[20,1,20,3],[20,4,20,6],[20,7,20,11],[15,1,16,3],[15,4,16,6],[15,7,16,11],[17,1,17,3],[17,4,17,6],[17,7,18,11],[18,1,18,3],[18,4,18,6],[26,1,26,3],[26,4,26,6],[26,7,26,11],[27,1,27,3],[27,4,27,6],[27,7,27,11],[22,1,23,3],[22,4,23,6],[22,7,23,11],[24,1,24,3],[24,4,24,6],[24,7,25,11],[25,1,25,3],[25,4,25,6],[33,1,33,3],[33,4,33,6],[33,7,33,11],[34,1,34,3],[34,4,34,6],[34,7,34,11],[29,1,30,3],[29,4,30,6],[29,7,30,11],[31,1,31,3],[31,4,31,6],[31,7,32,11],[32,1,32,3],[32,4,32,6],[40,1,40,3],[40,4,40,6],[40,7,40,11],[41,1,41,3],[41,4,41,6],[41,7,41,11],[36,1,37,3],[36,4,37,6],[36,7,37,11],[38,1,38,3],[38,4,38,6],[38,7,39,11],[39,1,39,3],[39,4,39,6],[47,1,47,3],[47,4,47,6],[47,7,47,11],[48,1,48,3],[48,4,48,6],[48,7,48,11],[43,1,44,3],[43,4,44,6],[43,7,44,11],[45,1,45,3],[45,4,45,6],[45,7,46,11],[46,1,46,3],[46,4,46,6],[54,1,54,3],[54,4,54,6],[54,7,54,11],[55,1,55,3],[55,4,55,6],[55,7,55,11],[50,1,51,3],[50,4,51,6],[50,7,51,11],[52,1,52,3],[52,4,52,6],[52,7,53,11],[53,1,53,3],[53,4,53,6],[62,1,62,3],[62,4,62,6],[62,7,62,11],[63,1,63,3],[63,4,63,6],[63,7,63,11],[58,1,59,3],[58,4,59,6],[58,7,59,11],[60,1,60,3],[60,4,60,6],[60,7,61,11],[61,1,61,3],[61,4,61,6],[69,1,69,3],[69,4,69,6],[69,7,69,11],[70,1,70,3],[70,4,70,6],[70,7,70,11],[65,1,66,3],[65,4,66,6],[65,7,66,11],[67,1,67,3],[67,4,67,6],[67,7,68,11],[68,1,68,3],[68,4,68,6],[76,1,76,3],[76,4,76,6],[76,7,76,11],[77,1,77,3],[77,4,77,6],[77,7,77,11],[72,1,73,3],[72,4,73,6],[72,7,73,11],[74,1,74,3],[74,4,74,6],[74,7,75,11],[75,1,75,3],[75,4,75,6]]}
["Cliente",null,null,null,null,null,null,null,null,"Mes",{"$f":"+novF!K1","v":"2019-11-01"}]
[]
[{"$f":"+Calendar!A5","v":"Rainbow Inc"}]
["Libros",null,null,null,null,null,null,null,null,"Horario"]
[]
[null,null,null,"Grupo / nivel",null,null,"Profesor",null,null,"Dias",{"$f":"+Calendar!AI12","v":"Martes"},{"$f":"+Calendar!AI14","v":"Jueves"}]
[null,null,null,{"$f":"+Calendar!Q5","v":"E1 - A1-1 Basico"},null,null,{"$f":"+Calendar!AI21","v":"Chris"},null,null,"Hora",{"$f":"+Calendar!AI17","v":"16:30:00"},{"$f":"+Calendar!AI18","v":"18:30:00"}]
[]
["Date","Material",null,null,"Content",null,null,"Aim"]
[{"$f":"+novF!C9","v":"2019-11-05"}]
["Speaking"]
["Writing"]
["Listening",null,null,null,null,null,null,"Comments"]
["Reading"]
[]
["Date","Material",null,null,"Content",null,null,"Aim"]
[{"$f":"+novF!D9","v":"2019-11-07"},"Coursebook"]
["Speaking"]
["Writing"]
["Listening",null,null,null,null,null,null,"Comments"]
["Reading"]
[]
["Date","Material",null,null,"Content",null,null,"Aim"]
[{"$f":"+novF!E9","v":"2019-11-12"},"Coursebook"]
["Speaking"]
["Writing"]
["Listening",null,null,null,null,null,null,"Comments"]
["Reading"]
[]
["Date","Material",null,null,"Content",null,null,"Aim"]
[{"$f":"+novF!F9","v":"2019-11-14"},"Coursebook"]
["Speaking"]
["Writing"]
["Listening",null,null,null,null,null,null,"Comments"]
["Reading"]
[]
["Date","Material",null,null,"Content",null,null,"Aim"]
[{"$f":"+novF!G9","v":"2019-11-19"},"Coursebook"]
["Speaking"]
["Writing"]
["Listening",null,null,null,null,null,null,"Comments"]
["Reading"]
[]
["Date","Material",null,null,"Content",null,null,"Aim"]
[{"$f":"+novF!H9","v":"2019-11-21"},"Coursebook"]
["Speaking"]
["Writing"]
["Listening",null,null,null,null,null,null,"Comments"]
["Reading"]
[]
["Date","Material",null,null,"Content",null,null,"Aim"]
[{"$f":"+novF!I9","v":"2019-11-26"},"Coursebook"]
["Speaking"]
["Writing"]
["Listening",null,null,null,null,null,null,"Comments"]
["Reading"]
[]
[]
["Date","Material",null,null,"Content",null,null,"Aim"]
[{"$f":"+novF!J9","v":"2019-11-28"},"Coursebook"]
["Speaking"]
["Writing"]
["Listening",null,null,null,null,null,null,"Comments"]
["Reading"]
[]
["Date","Material",null,null,"Content",null,null,"Aim"]
[{"$f":"+novF!K9","v":""},"Coursebook"]
["Speaking"]
["Writing"]
["Listening",null,null,null,null,null,null,"Comments"]
["Reading"]
[]
["Date","Material",null,null,"Content",null,null,"Aim"]
[{"$f":"+novF!L9","v":""},"Coursebook"]
["Speaking"]
["Writing"]
["Listening",null,null,null,null,null,null,"Comments"]
["Reading"]

{"sheet":"dic","index":17,"n_rows":78,"n_cols":12,"rows_kept":78,"cut":false,"hidden":true,"merged":[[5,0,5,2],[5,3,5,5],[5,6,5,8],[6,0,6,2],[6,3,6,5],[6,6,6,8],[0,0,1,2],[0,9,1,9],[0,10,1,11],[2,0,2,2],[3,0,4,2],[3,9,4,11],[12,1,12,3],[12,4,12,6],[12,7,12,11],[13,1,13,3],[13,4,13,6],[13,7,13,11],[8,1,9,3],[8,4,9,6],[8,7,9,11],[10,1,10,3],[10,4,10,6],[10,7,11,11],[11,1,11,3],[11,4,11,6],[19,1,19,3],[19,4,19,6],[19,7,19,11],[20,1,20,3],[20,4,20,6],[20,7,20,11],[15,1,16,3],[15,4,16,6],[15,7,16,11],[17,1,17,3],[17,4,17,6],[17,7,18,11],[18,1,18,3],[18,4,18,6],[26,1,26,3],[26,4,26,6],[26,7,26,11],[27,1,27,3],[27,4,27,6],[27,7,27,11],[22,1,23,3],[22,4,23,6],[22,7,23,11],[24,1,24,3],[24,4,24,6],[24,7,25,11],[25,1,25,3],[25,4,25,6],[33,1,33,3],[33,4,33,6],[33,7,33,11],[34,1,34,3],[34,4,34,6],[34,7,34,11],[29,1,30,3],[29,4,30,6],[29,7,30,11],[31,1,31,3],[31,4,31,6],[31,7,32,11],[32,1,32,3],[32,4,32,6],[40,1,40,3],[40,4,40,6],[40,7,40,11],[41,1,41,3],[41,4,41,6],[41,7,41,11],[36,1,37,3],[36,4,37,6],[36,7,37,11],[38,1,38,3],[38,4,38,6],[38,7,39,11],[39,1,39,3],[39,4,39,6],[47,1,47,3],[47,4,47,6],[47,7,47,11],[48,1,48,3],[48,4,48,6],[48,7,48,11],[43,1,44,3],[43,4,44,6],[43,7,44,11],[45,1,45,3],[45,4,45,6],[45,7,46,11],[46,1,46,3],[46,4,46,6],[54,1,54,3],[54,4,54,6],[54,7,54,11],[55,1,55,3],[55,4,55,6],[55,7,55,11],[50,1,51,3],[50,4,51,6],[50,7,51,11],[52,1,52,3],[52,4,52,6],[52,7,53,11],[53,1,53,3],[53,4,53,6],[62,1,62,3],[62,4,62,6],[62,7,62,11],[63,1,63,3],[63,4,63,6],[63,7,63,11],[58,1,59,3],[58,4,59,6],[58,7,59,11],[60,1,60,3],[60,4,60,6],[60,7,61,11],[61,1,61,3],[61,4,61,6],[69,1,69,3],[69,4,69,6],[69,7,69,11],[70,1,70,3],[70,4,70,6],[70,7,70,11],[65,1,66,3],[65,4,66,6],[65,7,66,11],[67,1,67,3],[67,4,67,6],[67,7,68,11],[68,1,68,3],[68,4,68,6],[76,1,76,3],[76,4,76,6],[76,7,76,11],[77,1,77,3],[77,4,77,6],[77,7,77,11],[72,1,73,3],[72,4,73,6],[72,7,73,11],[74,1,74,3],[74,4,74,6],[74,7,75,11],[75,1,75,3],[75,4,75,6]]}
["Cliente",null,null,null,null,null,null,null,null,"Mes",{"$f":"+dicF!K1","v":"2019-12-01"}]
[]
[{"$f":"+Calendar!A5","v":"Rainbow Inc"}]
["Libros",null,null,null,null,null,null,null,null,"Horario"]
[]
[null,null,null,"Grupo / nivel",null,null,"Profesor",null,null,"Dias",{"$f":"+Calendar!AI12","v":"Martes"},{"$f":"+Calendar!AI14","v":"Jueves"}]
[null,null,null,{"$f":"+Calendar!Q5","v":"E1 - A1-1 Basico"},null,null,{"$f":"+Calendar!AI21","v":"Chris"},null,null,"Hora",{"$f":"+Calendar!AI17","v":"16:30:00"},{"$f":"+Calendar!AI18","v":"18:30:00"}]
[]
["Date","Material",null,null,"Content",null,null,"Aim"]
[{"$f":"+dicF!C9","v":"2019-12-03"}]
["Speaking"]
["Writing"]
["Listening",null,null,null,null,null,null,"Comments"]
["Reading"]
[]
["Date","Material",null,null,"Content",null,null,"Aim"]
[{"$f":"+dicF!D9","v":"2019-12-05"},"Coursebook"]
["Speaking"]
["Writing"]
["Listening",null,null,null,null,null,null,"Comments"]
["Reading"]
[]
["Date","Material",null,null,"Content",null,null,"Aim"]
[{"$f":"+dicF!E9","v":"2019-12-10"},"Coursebook"]
["Speaking"]
["Writing"]
["Listening",null,null,null,null,null,null,"Comments"]
["Reading"]
[]
["Date","Material",null,null,"Content",null,null,"Aim"]
[{"$f":"+dicF!F9","v":"2019-12-12"},"Coursebook"]
["Speaking"]
["Writing"]
["Listening",null,null,null,null,null,null,"Comments"]
["Reading"]
[]
["Date","Material",null,null,"Content",null,null,"Aim"]
[{"$f":"+dicF!G9","v":"2019-12-17"},"Coursebook"]
["Speaking"]
["Writing"]
["Listening",null,null,null,null,null,null,"Comments"]
["Reading"]
[]
["Date","Material",null,null,"Content",null,null,"Aim"]
[{"$f":"+dicF!H9","v":"2019-12-19"},"Coursebook"]
["Speaking"]
["Writing"]
["Listening",null,null,null,null,null,null,"Comments"]
["Reading"]
[]
["Date","Material",null,null,"Content",null,null,"Aim"]
[{"$f":"+dicF!I9","v":""},"Coursebook"]
["Speaking"]
["Writing"]
["Listening",null,null,null,null,null,null,"Comments"]
["Reading"]
[]
[]
["Date","Material",null,null,"Content",null,null,"Aim"]
[{"$f":"+dicF!J9","v":""},"Coursebook"]
["Speaking"]
["Writing"]
["Listening",null,null,null,null,null,null,"Comments"]
["Reading"]
[]
["Date","Material",null,null,"Content",null,null,"Aim"]
[{"$f":"+dicF!K9","v":""},"Coursebook"]
["Speaking"]
["Writing"]
["Listening",null,null,null,null,null,null,"Comments"]
["Reading"]
[]
["Date","Material",null,null,"Content",null,null,"Aim"]
[{"$f":"+dicF!L9","v":""},"Coursebook"]
["Speaking"]
["Writing"]
["Listening",null,null,null,null,null,null,"Comments"]
["Reading"]

{"sheet":"EOT3","index":18,"n_rows":319,"n_cols":12,"rows_kept":319,"cut":false,"hidden":true,"merged":[[0,10,1,11],[2,0,2,2],[3,0,4,2],[17,0,17,1],[17,2,17,5],[12,0,12,1],[12,2,12,3],[12,4,12,5],[3,9,4,11],[5,0,6,2],[5,3,5,5],[5,6,5,8],[6,3,6,5],[6,6,6,8],[0,0,1,2],[0,7,1,9],[12,6,15,8],[12,9,15,11],[13,0,13,1],[13,2,13,3],[13,4,13,5],[14,0,14,1],[14,2,14,3],[8,9,8,11],[8,0,8,2],[8,3,8,5],[8,6,8,8],[17,6,17,11],[18,2,22,3],[18,4,18,5],[18,6,22,11],[19,4,19,5],[20,4,20,5],[21,4,21,5],[22,4,22,5],[15,2,15,3],[15,4,15,5],[10,9,10,11],[14,4,14,5],[15,0,15,1],[9,0,9,2],[9,3,9,5],[9,6,9,8],[9,9,9,11],[10,0,10,1],[10,2,10,3],[10,4,10,5],[10,6,10,8],[37,0,38,2],[37,3,37,5],[37,6,37,8],[38,3,38,5],[38,6,38,8],[40,0,40,2],[40,3,40,5],[40,6,40,8],[32,0,33,2],[32,7,33,9],[35,0,36,2],[35,9,36,11],[40,9,40,11],[32,10,33,11],[34,0,34,2],[41,0,41,2],[41,3,41,5],[41,6,41,8],[41,9,41,11],[42,0,42,1],[42,2,42,3],[42,4,42,5],[42,6,42,8],[42,9,42,11],[68,0,69,2],[68,9,69,11],[49,6,49,11],[50,2,54,3],[50,4,50,5],[50,6,54,11],[51,4,51,5],[52,4,52,5],[53,4,53,5],[54,4,54,5],[65,0,66,2],[65,7,66,9],[49,0,49,1],[49,2,49,5],[44,0,44,1],[44,2,44,3],[44,4,44,5],[65,10,66,11],[67,0,67,2],[44,6,47,8],[44,9,47,11],[45,0,45,1],[45,2,45,3],[45,4,45,5],[46,0,46,1],[46,2,46,3],[46,4,46,5],[47,0,47,1],[47,2,47,3],[47,4,47,5],[79,4,79,5],[80,0,80,1],[80,2,80,3],[80,4,80,5],[70,0,71,2],[70,3,70,5],[70,6,70,8],[71,3,71,5],[71,6,71,8],[73,0,73,2],[73,3,73,5],[73,6,73,8],[73,9,73,11],[74,0,74,2],[74,3,74,5],[74,6,74,8],[74,9,74,11],[75,0,75,1],[75,2,75,3],[75,4,75,5],[75,6,75,8],[75,9,75,11],[82,0,82,1],[82,2,82,5],[77,0,77,1],[77,2,77,3],[77,4,77,5],[98,10,99,11],[100,0,100,2],[101,0,102,2],[101,9,102,11],[82,6,82,11],[83,2,87,3],[83,4,83,5],[83,6,87,11],[84,4,84,5],[85,4,85,5],[86,4,86,5],[87,4,87,5],[77,6,80,8],[77,9,80,11],[78,0,78,1],[78,2,78,3],[78,4,78,5],[79,0,79,1],[79,2,79,3],[103,0,104,2],[103,3,103,5],[103,6,103,8],[104,3,104,5],[104,6,104,8],[106,0,106,2],[106,3,106,5],[106,6,106,8],[98,0,99,2],[98,7,99,9],[106,9,106,11],[107,0,107,2],[107,3,107,5],[107,6,107,8],[107,9,107,11],[108,0,108,1],[108,2,108,3],[108,4,108,5],[108,6,108,8],[108,9,108,11],[134,0,135,2],[134,9,135,11],[115,6,115,11],[116,2,120,3],[116,4,116,5],[116,6,120,11],[117,4,117,5],[118,4,118,5],[119,4,119,5],[120,4,120,5],[131,0,132,2],[131,7,132,9],[115,0,115,1],[115,2,115,5],[110,0,110,1],[110,2,110,3],[110,4,110,5],[131,10,132,11],[133,0,133,2],[110,6,113,8],[110,9,113,11],[111,0,111,1],[111,2,111,3],[111,4,111,5],[112,0,112,1],[112,2,112,3],[112,4,112,5],[113,0,113,1],[113,2,113,3],[113,4,113,5],[145,4,145,5],[146,0,146,1],[146,2,146,3],[146,4,146,5],[136,0,137,2],[136,3,136,5],[136,6,136,8],[137,3,137,5],[137,6,137,8],[139,0,139,2],[139,3,139,5],[139,6,139,8],[139,9,139,11],[140,0,140,2],[140,3,140,5],[140,6,140,8],[140,9,140,11],[141,0,141,1],[141,2,141,3],[141,4,141,5],[141,6,141,8],[141,9,141,11],[148,0,148,1],[148,2,148,5],[143,0,143,1],[143,2,143,3],[143,4,143,5],[164,10,165,11],[166,0,166,2],[167,0,168,2],[167,9,168,11],[148,6,148,11],[149,2,153,3],[149,4,149,5],[149,6,153,11],[150,4,150,5],[151,4,151,5],[152,4,152,5],[153,4,153,5],[143,6,146,8],[143,9,146,11],[144,0,144,1],[144,2,144,3],[144,4,144,5],[145,0,145,1],[145,2,145,3],[169,0,170,2],[169,3,169,5],[169,6,169,8],[170,3,170,5],[170,6,170,8],[172,0,172,2],[172,3,172,5],[172,6,172,8],[164,0,165,2],[164,7,165,9],[172,9,172,11],[173,0,173,2],[173,3,173,5],[173,6,173,8],[173,9,173,11],[174,0,174,1],[174,2,174,3],[174,4,174,5],[174,6,174,8],[174,9,174,11],[200,0,201,2],[200,9,201,11],[181,6,181,11],[182,2,186,3],[182,4,182,5],[182,6,186,11],[183,4,183,5],[184,4,184,5],[185,4,185,5],[186,4,186,5],[197,0,198,2],[197,7,198,9],[181,0,181,1],[181,2,181,5],[176,0,176,1],[176,2,176,3],[176,4,176,5],[197,10,198,11],[199,0,199,2],[176,6,179,8],[176,9,179,11],[177,0,177,1],[177,2,177,3],[177,4,177,5],[178,0,178,1],[178,2,178,3],[178,4,178,5],[179,0,179,1],[179,2,179,3],[179,4,179,5],[211,4,211,5],[212,0,212,1],[212,2,212,3],[212,4,212,5],[202,0,203,2],[202,3,202,5],[202,6,202,8],[203,3,203,5],[203,6,203,8],[205,0,205,2],[205,3,205,5],[205,6,205,8],[205,9,205,11],[206,0,206,2],[206,3,206,5],[206,6,206,8],[206,9,206,11],[207,0,207,1],[207,2,207,3],[207,4,207,5],[207,6,207,8],[207,9,207,11],[214,0,214,1],[214,2,214,5],[209,0,209,1],[209,2,209,3],[209,4,209,5],[230,10,231,11],[232,0,232,2],[233,0,234,2],[233,9,234,11],[214,6,214,11],[215,2,219,3],[215,4,215,5],[215,6,219,11],[216,4,216,5],[217,4,217,5],[218,4,218,5],[219,4,219,5],[209,6,212,8],[209,9,212,11],[210,0,210,1],[210,2,210,3],[210,4,210,5],[211,0,211,1],[211,2,211,3],[235,0,236,2],[235,3,235,5],[235,6,235,8],[236,3,236,5],[236,6,236,8],[238,0,238,2],[238,3,238,5],[238,6,238,8],[230,0,231,2],[230,7,231,9],[238,9,238,11],[239,0,239,2],[239,3,239,5],[239,6,239,8],[239,9,239,11],[240,0,240,1],[240,2,240,3],[240,4,240,5],[240,6,240,8],[240,9,240,11],[266,0,267,2],[266,9,267,11],[247,6,247,11],[248,2,252,3],[248,4,248,5],[248,6,252,11],[249,4,249,5],[250,4,250,5],[251,4,251,5],[252,4,252,5],[263,0,264,2],[263,7,264,9],[247,0,247,1],[247,2,247,5],[242,0,242,1],[242,2,242,3],[242,4,242,5],[263,10,264,11],[265,0,265,2],[242,6,245,8],[242,9,245,11],[243,0,243,1],[243,2,243,3],[243,4,243,5],[244,0,244,1],[244,2,244,3],[244,4,244,5],[245,0,245,1],[245,2,245,3],[245,4,245,5],[277,4,277,5],[278,0,278,1],[278,2,278,3],[278,4,278,5],[268,0,269,2],[268,3,268,5],[268,6,268,8],[269,3,269,5],[269,6,269,8],[271,0,271,2],[271,3,271,5],[271,6,271,8],[271,9,271,11],[272,0,272,2],[272,3,272,5],[272,6,272,8],[272,9,272,11],[273,0,273,1],[273,2,273,3],[273,4,273,5],[273,6,273,8],[273,9,273,11],[280,0,280,1],[280,2,280,5],[275,0,275,1],[275,2,275,3],[275,4,275,5],[296,10,297,11],[298,0,298,2],[299,0,300,2],[299,9,300,11],[280,6,280,11],[281,2,285,3],[281,4,281,5],[281,6,285,11],[282,4,282,5],[283,4,283,5],[284,4,284,5],[285,4,285,5],[275,6,278,8],[275,9,278,11],[276,0,276,1],[276,2,276,3],[276,4,276,5],[277,0,277,1],[277,2,277,3],[301,0,302,2],[301,3,301,5],[301,6,301,8],[302,3,302,5],[302,6,302,8],[304,0,304,2],[304,3,304,5],[304,6,304,8],[296,0,297,2],[296,7,297,9],[304,9,304,11],[305,0,305,2],[305,3,305,5],[305,6,305,8],[305,9,305,11],[306,0,306,1],[306,2,306,3],[306,4,306,5],[306,6,306,8],[306,9,306,11],[311,0,311,1],[311,2,311,3],[311,4,311,5],[313,0,313,1],[313,2,313,5],[308,0,308,1],[308,2,308,3],[308,4,308,5],[308,6,311,8],[309,0,309,1],[309,2,309,3],[309,4,309,5],[310,0,310,1],[310,2,310,3],[313,6,313,11],[314,2,318,3],[314,4,314,5],[314,6,318,11],[315,4,315,5],[316,4,316,5],[317,4,317,5],[318,4,318,5],[310,4,310,5],[308,9,311,11]]}
["Cliente",null,null,null,null,null,null,"Informe trimestral",null,null,{"$f":"+'EOT3 Asis'!K1:L2","v":"sep - dic"}]
[]
[{"$f":"+Calendar!A5","v":"Rainbow Inc"}]
["Estudiante",null,null,null,null,null,null,null,null,"Horario"]
[]
[{"$f":"+Calendar!B42","v":"Rod"},null,null,"Grupo / nivel",null,null,"Profesor",null,null,"Dias",{"$f":"+Calendar!AI12","v":"Martes"},{"$f":"+Calendar!AI14","v":"Jueves"}]
[null,null,null,{"$f":"+Calendar!Q5","v":"E1 - A1-1 Basico"},null,null,{"$f":"+Calendar!AI21","v":"Chris"},null,null,"Hora",{"$f":"+Calendar!AI17","v":"16:30:00"},{"$f":"+Calendar!AI18","v":"18:30:00"}]
[]
["Objectivo Hablar",null,null,"Objectivo Escribir",null,null,"Objectivo Escuchar",null,null,"Objectivo Leer"]
[{"$f":"+'Obj3'!A10:C12","v":9},null,null,{"$f":"+'Obj3'!D10:F12","v":10},null,null,{"$f":"+'Obj3'!G10:I12","v":11},null,null,{"$f":"+'Obj3'!J10:L12","v":12}]
["Capacidades",null,"Puntuación %",null,"Objetivos alcanzados",null,"Puntos Fuertes",null,null,"Puntos Debíles"]
[]
["Hablar",null,0.9,null,"Si o No",null,"•\n•\n•",null,null,"•\n•\n•"]
["Escribir",null,0.1,null,"Si o No"]
["Escuchar",null,0.9,null,"Si o No"]
["Leer",null,0.8,null,"Si o No"]
[]
["Asistencia",null,null,null,null,null,"Comentarios"]
[{"$f":"+sepF!$K$1","v":"2019-09-01"},{"$f":"+'EOT3 Asis'!C41","v":0},{"$f":"SUM(C13:D16)/4","v":0.67500000000000004},null,"Excelente"]
[{"$f":"octF!$K$1","v":"2019-10-01"},{"$f":"+'EOT3 Asis'!C42","v":0},null,null,"Muy Bueno"]
[{"$f":"novF!$K$1","v":"2019-11-01"},{"$f":"+'EOT3 Asis'!C43","v":0},null,null,"Bueno"]
[{"$f":"dicF!$K$1","v":"2019-12-01"},{"$f":"+'EOT3 Asis'!C44","v":0},null,null,"Satisfactaria"]
["Total",{"$f":"+'EOT3 Asis'!L12","v":0}]
[]
[]
[]
[]
[]
[]
[]
[]
[]
["Cliente",null,null,null,null,null,null,"Informe trimestral",null,null,{"$f":"+$K$1","v":"sep - dic"}]
[]
[{"$f":"+$A$3","v":"Rainbow Inc"}]
["Estudiante",null,null,null,null,null,null,null,null,"Horario"]
[]
[{"$f":"+Calendar!B43","v":"Jane"},null,null,"Grupo / nivel",null,null,"Profesor",null,null,"Dias",{"$f":"+$K$6","v":"Martes"},{"$f":"+$L$6","v":"Jueves"}]
[null,null,null,{"$f":"+$D$7","v":"E1 - A1-1 Basico"},null,null,{"$f":"+$G$7","v":"Chris"},null,null,"Hora",{"$f":"+$K$7","v":"16:30:00"},{"$f":"+$L$7","v":"18:30:00"}]
[]
["Objectivo Hablar",null,null,"Objectivo Escribir",null,null,"Objectivo Escuchar",null,null,"Objectivo Leer"]
[{"$f":"+$A$10","v":9},null,null,{"$f":"+$D$10","v":10},null,null,{"$f":"+$G$10","v":11},null,null,{"$f":"+$J$10","v":12}]
["Capacidades",null,"Puntuación %",null,"Objetivos alcanzados",null,"Puntos Fuertes",null,null,"Puntos Debíles"]
[]
["Hablar",null,0.2,null,"Si o No",null,"•\n•\n•",null,null,"•\n•\n•"]
["Escribir",null,0.7,null,"Si o No"]
["Escuchar",null,0.7,null,"Si o No"]
["Leer",null,0.8,null,"Si o No"]
[]
["Asistencia",null,null,null,null,null,"Comentarios"]
[{"$f":"+$A$19","v":"2019-09-01"},{"$f":"+'EOT3 Asis'!D41","v":0},{"$f":"SUM(C45:D48)/4","v":0.6},null,"Excelente"]
[{"$f":"+$A$20","v":"2019-10-01"},{"$f":"+'EOT3 Asis'!D42","v":0},null,null,"Muy Bueno"]
[{"$f":"+$A$21","v":"2019-11-01"},{"$f":"+'EOT3 Asis'!D43","v":0},null,null,"Bueno"]
[{"$f":"+$A$22","v":"2019-12-01"},{"$f":"+'EOT3 Asis'!D44","v":0},null,null,"Satisfactaria"]
["Total",{"$f":"+'EOT3 Asis'!L13","v":0}]
[]
[]
[]
[]
[]
[]
[]
[]
[]
[]
["Cliente",null,null,null,null,null,null,"Informe trimestral",null,null,{"$f":"+$K$1","v":"sep - dic"}]
[]
[{"$f":"+$A$3","v":"Rainbow Inc"}]
["Estudiante",null,null,null,null,null,null,null,null,"Horario"]
[]
[{"$f":"+Calendar!B44","v":"Freddy"},null,null,"Grupo / nivel",null,null,"Profesor",null,null,"Dias",{"$f":"+$K$6","v":"Martes"},{"$f":"+$L$6","v":"Jueves"}]
[null,null,null,{"$f":"+$D$7","v":"E1 - A1-1 Basico"},null,null,{"$f":"+$G$7","v":"Chris"},null,null,"Hora",{"$f":"+$K$7","v":"16:30:00"},{"$f":"+$L$7","v":"18:30:00"}]
[]
["Objectivo Hablar",null,null,"Objectivo Escribir",null,null,"Objectivo Escuchar",null,null,"Objectivo Leer"]
[{"$f":"+$A$10","v":9},null,null,{"$f":"+$D$10","v":10},null,null,{"$f":"+$G$10","v":11},null,null,{"$f":"+$J$10","v":12}]
["Capacidades",null,"Puntuación %",null,"Objetivos alcanzados",null,"Puntos Fuertes",null,null,"Puntos Debíles"]
[]
["Hablar",null,0.9,null,"Si o No",null,"•\n•\n•",null,null,"•\n•\n•"]
["Escribir",null,0.1,null,"Si o No"]
["Escuchar",null,0.9,null,"Si o No"]
["Leer",null,0.8,null,"Si o No"]
[]
["Asistencia",null,null,null,null,null,"Comentarios"]
[{"$f":"+$A$19","v":"2019-09-01"},{"$f":"+'EOT3 Asis'!E41","v":0},{"$f":"SUM(C78:D81)/4","v":0.67500000000000004},null,"Excelente"]
[{"$f":"+$A$20","v":"2019-10-01"},{"$f":"+'EOT3 Asis'!E42","v":0},null,null,"Muy Bueno"]
[{"$f":"+$A$21","v":"2019-11-01"},{"$f":"+'EOT3 Asis'!E43","v":0},null,null,"Bueno"]
[{"$f":"+$A$22","v":"2019-12-01"},{"$f":"+'EOT3 Asis'!E44","v":0},null,null,"Satisfactaria"]
["Total",{"$f":"+'EOT3 Asis'!L14","v":0}]
[]
[]
[]
[]
[]
[]
[]
[]
[]
[]
["Cliente",null,null,null,null,null,null,"Informe trimestral",null,null,{"$f":"+$K$1","v":"sep - dic"}]
[]
[{"$f":"+$A$3","v":"Rainbow Inc"}]
["Estudiante",null,null,null,null,null,null,null,null,"Horario"]
[]
[{"$f":"+Calendar!B45","v":"George"},null,null,"Grupo / nivel",null,null,"Profesor",null,null,"Dias",{"$f":"+$K$6","v":"Martes"},{"$f":"+$L$6","v":"Jueves"}]
[null,null,null,{"$f":"+$D$7","v":"E1 - A1-1 Basico"},null,null,{"$f":"+$G$7","v":"Chris"},null,null,"Hora",{"$f":"+$K$7","v":"16:30:00"},{"$f":"+$L$7","v":"18:30:00"}]
[]
["Objectivo Hablar",null,null,"Objectivo Escribir",null,null,"Objectivo Escuchar",null,null,"Objectivo Leer"]
[{"$f":"+$A$10","v":9},null,null,{"$f":"+$D$10","v":10},null,null,{"$f":"+$G$10","v":11},null,null,{"$f":"+$J$10","v":12}]
["Capacidades",null,"Puntuación %",null,"Objetivos alcanzados",null,"Puntos Fuertes",null,null,"Puntos Debíles"]
[]
["Hablar",null,0.9,null,"Si o No",null,"•\n•\n•",null,null,"•\n•\n•"]
["Escribir",null,0.1,null,"Si o No"]
["Escuchar",null,0.9,null,"Si o No"]
["Leer",null,0.8,null,"Si o No"]
[]
["Asistencia",null,null,null,null,null,"Comentarios"]
[{"$f":"+$A$19","v":"2019-09-01"},{"$f":"+'EOT3 Asis'!F41","v":0},{"$f":"SUM(C111:D114)/4","v":0.67500000000000004},null,"Excelente"]
[{"$f":"+$A$20","v":"2019-10-01"},{"$f":"+'EOT3 Asis'!F42","v":0},null,null,"Muy Bueno"]
[{"$f":"+$A$21","v":"2019-11-01"},{"$f":"+'EOT3 Asis'!F43","v":0},null,null,"Bueno"]
[{"$f":"+$A$22","v":"2019-12-01"},{"$f":"+'EOT3 Asis'!F44","v":0},null,null,"Satisfactaria"]
["Total",{"$f":"+'EOT3 Asis'!L14","v":0}]
[]
[]
[]
[]
[]
[]
[]
[]
[]
[]
["Cliente",null,null,null,null,null,null,"Informe trimestral",null,null,{"$f":"+$K$1","v":"sep - dic"}]
[]
[{"$f":"+$A$3","v":"Rainbow Inc"}]
["Estudiante",null,null,null,null,null,null,null,null,"Horario"]
[]
[{"$f":"+Calendar!B46","v":"Bungle"},null,null,"Grupo / nivel",null,null,"Profesor",null,null,"Dias",{"$f":"+$K$6","v":"Martes"},{"$f":"+$L$6","v":"Jueves"}]
[null,null,null,{"$f":"+$D$7","v":"E1 - A1-1 Basico"},null,null,{"$f":"+$G$7","v":"Chris"},null,null,"Hora",{"$f":"+$K$7","v":"16:30:00"},{"$f":"+$L$7","v":"18:30:00"}]
[]
["Objectivo Hablar",null,null,"Objectivo Escribir",null,null,"Objectivo Escuchar",null,null,"Objectivo Leer"]
[{"$f":"+$A$10","v":9},null,null,{"$f":"+$D$10","v":10},null,null,{"$f":"+$G$10","v":11},null,null,{"$f":"+$J$10","v":12}]
["Capacidades",null,"Puntuación %",null,"Objetivos alcanzados",null,"Puntos Fuertes",null,null,"Puntos Debíles"]
[]
["Hablar",null,0.9,null,"Si o No",null,"•\n•\n•",null,null,"•\n•\n•"]
["Escribir",null,0.1,null,"Si o No"]
["Escuchar",null,0.9,null,"Si o No"]
["Leer",null,0.8,null,"Si o No"]
[]
["Asistencia",null,null,null,null,null,"Comentarios"]
[{"$f":"+$A$19","v":"2019-09-01"},{"$f":"+'EOT3 Asis'!G41","v":0},{"$f":"SUM(C144:D147)/4","v":0.67500000000000004},null,"Excelente"]
[{"$f":"+$A$20","v":"2019-10-01"},{"$f":"+'EOT3 Asis'!G42","v":0},null,null,"Muy Bueno"]
[{"$f":"+$A$21","v":"2019-11-01"},{"$f":"+'EOT3 Asis'!G43","v":0},null,null,"Bueno"]
[{"$f":"+$A$22","v":"2019-12-01"},{"$f":"+'EOT3 Asis'!G44","v":0},null,null,"Satisfactaria"]
["Total",{"$f":"+'EOT3 Asis'!L16","v":0}]
[]
[]
[]
[]
[]
[]
[]
[]
[]
[]
["Cliente",null,null,null,null,null,null,"Informe trimestral",null,null,{"$f":"+$K$1","v":"sep - dic"}]
[]
[{"$f":"+$A$3","v":"Rainbow Inc"}]
["Estudiante",null,null,null,null,null,null,null,null,"Horario"]
[]
[{"$f":"+Calendar!B47","v":"Zippy"},null,null,"Grupo / nivel",null,null,"Profesor",null,null,"Dias",{"$f":"+$K$6","v":"Martes"},{"$f":"+$L$6","v":"Jueves"}]
[null,null,null,{"$f":"+$D$7","v":"E1 - A1-1 Basico"},null,null,{"$f":"+$G$7","v":"Chris"},null,null,"Hora",{"$f":"+$K$7","v":"16:30:00"},{"$f":"+$L$7","v":"18:30:00"}]
[]
["Objectivo Hablar",null,null,"Objectivo Escribir",null,null,"Objectivo Escuchar",null,null,"Objectivo Leer"]
[{"$f":"+$A$10","v":9},null,null,{"$f":"+$D$10","v":10},null,null,{"$f":"+$G$10","v":11},null,null,{"$f":"+$J$10","v":12}]
["Capacidades",null,"Puntuación %",null,"Objetivos alcanzados",null,"Puntos Fuertes",null,null,"Puntos Debíles"]
[]
["Hablar",null,0.9,null,"Si o No",null,"•\n•\n•",null,null,"•\n•\n•"]
["Escribir",null,0.1,null,"Si o No"]
["Escuchar",null,0.9,null,"Si o No"]
["Leer",null,0.8,null,"Si o No"]
[]
["Asistencia",null,null,null,null,null,"Comentarios"]
[{"$f":"+$A$19","v":"2019-09-01"},{"$f":"+'EOT3 Asis'!H41","v":0},{"$f":"SUM(C177:D180)/4","v":0.67500000000000004},null,"Excelente"]
[{"$f":"+$A$20","v":"2019-10-01"},{"$f":"+'EOT3 Asis'!H42","v":0},null,null,"Muy Bueno"]
[{"$f":"+$A$21","v":"2019-11-01"},{"$f":"+'EOT3 Asis'!H43","v":0},null,null,"Bueno"]
[{"$f":"+$A$22","v":"2019-12-01"},{"$f":"+'EOT3 Asis'!H44","v":0},null,null,"Satisfactaria"]
["Total",{"$f":"+'EOT3 Asis'!L17","v":0}]
[]
[]
[]
[]
[]
[]
[]
[]
[]
[]
["Cliente",null,null,null,null,null,null,"Informe trimestral",null,null,{"$f":"+$K$1","v":"sep - dic"}]
[]
[{"$f":"+$A$3","v":"Rainbow Inc"}]
["Estudiante",null,null,null,null,null,null,null,null,"Horario"]
[]
[{"$f":"+Calendar!B48","v":"Mathew"},null,null,"Grupo / nivel",null,null,"Profesor",null,null,"Dias",{"$f":"+$K$6","v":"Martes"},{"$f":"+$L$6","v":"Jueves"}]
[null,null,null,{"$f":"+$D$7","v":"E1 - A1-1 Basico"},null,null,{"$f":"+$G$7","v":"Chris"},null,null,"Hora",{"$f":"+$K$7","v":"16:30:00"},{"$f":"+$L$7","v":"18:30:00"}]
[]
["Objectivo Hablar",null,null,"Objectivo Escribir",null,null,"Objectivo Escuchar",null,null,"Objectivo Leer"]
[{"$f":"+$A$10","v":9},null,null,{"$f":"+$D$10","v":10},null,null,{"$f":"+$G$10","v":11},null,null,{"$f":"+$J$10","v":12}]
["Capacidades",null,"Puntuación %",null,"Objetivos alcanzados",null,"Puntos Fuertes",null,null,"Puntos Debíles"]
[]
["Hablar",null,0.9,null,"Si o No",null,"•\n•\n•",null,null,"•\n•\n•"]
["Escribir",null,0.1,null,"Si o No"]
["Escuchar",null,0.9,null,"Si o No"]
["Leer",null,0.8,null,"Si o No"]
[]
["Asistencia",null,null,null,null,null,"Comentarios"]
[{"$f":"+$A$19","v":"2019-09-01"},{"$f":"+'EOT3 Asis'!I41","v":0},{"$f":"SUM(C210:D213)/4","v":0.67500000000000004},null,"Excelente"]
[{"$f":"+$A$20","v":"2019-10-01"},{"$f":"+'EOT3 Asis'!I42","v":0},null,null,"Muy Bueno"]
[{"$f":"+$A$21","v":"2019-11-01"},{"$f":"+'EOT3 Asis'!I43","v":0},null,null,"Bueno"]
[{"$f":"+$A$22","v":"2019-12-01"},{"$f":"+'EOT3 Asis'!I44","v":0},null,null,"Satisfactaria"]
["Total",{"$f":"+'EOT3 Asis'!L18","v":0}]
[]
[]
[]
[]
[]
[]
[]
[]
[]
[]
["Cliente",null,null,null,null,null,null,"Informe trimestral",null,null,{"$f":"+$K$1","v":"sep - dic"}]
[]
[{"$f":"+$A$3","v":"Rainbow Inc"}]
["Estudiante",null,null,null,null,null,null,null,null,"Horario"]
[]
[{"$f":"+Calendar!B49","v":"Sooty"},null,null,"Grupo / nivel",null,null,"Profesor",null,null,"Dias",{"$f":"+$K$6","v":"Martes"},{"$f":"+$L$6","v":"Jueves"}]
[null,null,null,{"$f":"+$D$7","v":"E1 - A1-1 Basico"},null,null,{"$f":"+$G$7","v":"Chris"},null,null,"Hora",{"$f":"+$K$7","v":"16:30:00"},{"$f":"+$L$7","v":"18:30:00"}]
[]
["Objectivo Hablar",null,null,"Objectivo Escribir",null,null,"Objectivo Escuchar",null,null,"Objectivo Leer"]
[{"$f":"+$A$10","v":9},null,null,{"$f":"+$D$10","v":10},null,null,{"$f":"+$G$10","v":11},null,null,{"$f":"+$J$10","v":12}]
["Capacidades",null,"Puntuación %",null,"Objetivos alcanzados",null,"Puntos Fuertes",null,null,"Puntos Debíles"]
[]
["Hablar",null,0.9,null,"Si o No",null,"•\n•\n•",null,null,"•\n•\n•"]
["Escribir",null,0.1,null,"Si o No"]
["Escuchar",null,0.9,null,"Si o No"]
["Leer",null,0.8,null,"Si o No"]
[]
["Asistencia",null,null,null,null,null,"Comentarios"]
[{"$f":"+$A$19","v":"2019-09-01"},{"$f":"+'EOT3 Asis'!J41","v":0},{"$f":"SUM(C243:D246)/4","v":0.67500000000000004},null,"Excelente"]
[{"$f":"+$A$20","v":"2019-10-01"},{"$f":"+'EOT3 Asis'!J42","v":0},null,null,"Muy Bueno"]
[{"$f":"+$A$21","v":"2019-11-01"},{"$f":"+'EOT3 Asis'!J43","v":0},null,null,"Bueno"]
[{"$f":"+$A$22","v":"2019-12-01"},{"$f":"+'EOT3 Asis'!J44","v":0},null,null,"Satisfactaria"]
["Total",{"$f":"+'EOT3 Asis'!L19","v":0}]
[]
[]
[]
[]
[]
[]
[]
[]
[]
[]
["Cliente",null,null,null,null,null,null,"Informe trimestral",null,null,{"$f":"+$K$1","v":"sep - dic"}]
[]
[{"$f":"+$A$3","v":"Rainbow Inc"}]
["Estudiante",null,null,null,null,null,null,null,null,"Horario"]
[]
[{"$f":"+Calendar!B50","v":"Sweep"},null,null,"Grupo / nivel",null,null,"Profesor",null,null,"Dias",{"$f":"+$K$6","v":"Martes"},{"$f":"+$L$6","v":"Jueves"}]
[null,null,null,{"$f":"+$D$7","v":"E1 - A1-1 Basico"},null,null,{"$f":"+$G$7","v":"Chris"},null,null,"Hora",{"$f":"+$K$7","v":"16:30:00"},{"$f":"+$L$7","v":"18:30:00"}]
[]
["Objectivo Hablar",null,null,"Objectivo Escribir",null,null,"Objectivo Escuchar",null,null,"Objectivo Leer"]
[{"$f":"+$A$10","v":9},null,null,{"$f":"+$D$10","v":10},null,null,{"$f":"+$G$10","v":11},null,null,{"$f":"+$J$10","v":12}]
["Capacidades",null,"Puntuación %",null,"Objetivos alcanzados",null,"Puntos Fuertes",null,null,"Puntos Debíles"]
[]
["Hablar",null,0.9,null,"Si o No",null,"•\n•\n•",null,null,"•\n•\n•"]
["Escribir",null,0.1,null,"Si o No"]
["Escuchar",null,0.9,null,"Si o No"]
["Leer",null,0.8,null,"Si o No"]
[]
["Asistencia",null,null,null,null,null,"Comentarios"]
[{"$f":"+$A$19","v":"2019-09-01"},{"$f":"+'EOT3 Asis'!K41","v":0},{"$f":"SUM(C276:D279)/4","v":0.67500000000000004},null,"Excelente"]
[{"$f":"+$A$20","v":"2019-10-01"},{"$f":"+'EOT3 Asis'!K42","v":0},null,null,"Muy Bueno"]
[{"$f":"+$A$21","v":"2019-11-01"},{"$f":"+'EOT3 Asis'!K43","v":0},null,null,"Bueno"]
[{"$f":"+$A$22","v":"2019-12-01"},{"$f":"+'EOT3 Asis'!K44","v":0},null,null,"Satisfactaria"]
["Total",{"$f":"+'EOT3 Asis'!L20","v":0}]
[]
[]
[]
[]
[]
[]
[]
[]
[]
[]
["Cliente",null,null,null,null,null,null,"Informe trimestral",null,null,{"$f":"+$K$1","v":"sep - dic"}]
[]
[{"$f":"+$A$3","v":"Rainbow Inc"}]
["Estudiante",null,null,null,null,null,null,null,null,"Horario"]
[]
[{"$f":"+Calendar!B51","v":"Sue"},null,null,"Grupo / nivel",null,null,"Profesor",null,null,"Dias",{"$f":"+$K$6","v":"Martes"},{"$f":"+$L$6","v":"Jueves"}]
[null,null,null,{"$f":"+$D$7","v":"E1 - A1-1 Basico"},null,null,{"$f":"+$G$7","v":"Chris"},null,null,"Hora",{"$f":"+$K$7","v":"16:30:00"},{"$f":"+$L$7","v":"18:30:00"}]
[]
["Objectivo Hablar",null,null,"Objectivo Escribir",null,null,"Objectivo Escuchar",null,null,"Objectivo Leer"]
[{"$f":"+$A$10","v":9},null,null,{"$f":"+$D$10","v":10},null,null,{"$f":"+$G$10","v":11},null,null,{"$f":"+$J$10","v":12}]
["Capacidades",null,"Puntuación %",null,"Objetivos alcanzados",null,"Puntos Fuertes",null,null,"Puntos Debíles"]
[]
["Hablar",null,0.9,null,"Si o No",null,"•\n•\n•",null,null,"•\n•\n•"]
["Escribir",null,0.1,null,"Si o No"]
["Escuchar",null,0.9,null,"Si o No"]
["Leer",null,0.8,null,"Si o No"]
[]
["Asistencia",null,null,null,null,null,"Comentarios"]
[{"$f":"+$A$19","v":"2019-09-01"},{"$f":"+'EOT3 Asis'!L41","v":0},{"$f":"SUM(C309:D312)/4","v":0.67500000000000004},null,"Excelente"]
[{"$f":"+$A$20","v":"2019-10-01"},{"$f":"+'EOT3 Asis'!L42","v":0},null,null,"Muy Bueno"]
[{"$f":"+$A$21","v":"2019-11-01"},{"$f":"+'EOT3 Asis'!L43","v":0},null,null,"Bueno"]
[{"$f":"+$A$22","v":"2019-12-01"},{"$f":"+'EOT3 Asis'!L44","v":0},null,null,"Satisfactaria"]
["Total",{"$f":"+'EOT3 Asis'!L21","v":0}]

{"sheet":"EOT1 Asis","index":19,"n_rows":44,"n_cols":12,"rows_kept":44,"cut":false,"hidden":true,"merged":[[26,1,26,2],[31,1,31,2],[30,1,30,2],[29,1,29,2],[28,1,28,2],[27,1,27,2],[35,1,35,2],[34,1,34,2],[33,1,33,2],[32,1,32,2],[8,8,8,9],[20,0,20,1],[14,0,14,1],[9,0,9,1],[10,0,10,1],[11,0,11,1],[12,0,12,1],[13,0,13,1],[8,2,8,3],[8,4,8,5],[8,6,8,7],[19,0,19,1],[0,0,1,2],[0,9,1,9],[0,10,1,11],[2,0,2,2],[3,0,4,2],[3,9,4,11],[5,0,5,2],[5,3,5,5],[5,6,5,8],[6,0,6,2],[6,3,6,5],[6,6,6,8],[8,10,8,11],[15,0,15,1],[16,0,16,1],[17,0,17,1],[18,0,18,1]]}
["Cliente",null,null,null,null,null,null,null,null,"Mes",{"$f":"+'Obj1'!K1:L2","v":"ene - abr"}]
[]
[{"$f":"+Calendar!A5","v":"Rainbow Inc"}]
["Dirección",null,null,null,null,null,null,null,null,"Horario"]
[]
[{"$f":"+Calendar!AI2","v":"Toy street 1"},null,null,"Grupo / nivel",null,null,"Profesor",null,null,"Dias",{"$f":"+Calendar!AI12","v":"Martes"},{"$f":"+Calendar!AI14","v":"Jueves"}]
[{"$f":"+Calendar!AI3","v":"Barcelona"},null,null,{"$f":"+Calendar!Q5","v":"E1 - A1-1 Basico"},null,null,{"$f":"+Calendar!AI21","v":"Chris"},null,null,"Hora",{"$f":"+Calendar!AI17","v":"16:30:00"},{"$f":"+Calendar!AI18","v":"18:30:00"}]
[]
[null,null,{"$f":"+eneF!K1","v":"2019-01-01"},null,{"$f":"+febF!K1","v":"2019-02-01"},null,{"$f":"+marF!K1","v":"2019-03-01"},null,{"$f":"+abrF!K1","v":"2019-04-01"},null,"Total"]
["Estudiante",null,"Clases","Presente","Clases","Presente","Clases","Presente","Clases","Presente","Clases","Presente %"]
[]
[{"$f":"+Calendar!B42","v":"Rod"},null,3,null,3,null,4,null,2,null,{"$f":"+IF(A12=0,\" \",+C12+E12+G12+I12)","v":12},{"$f":"+IF(A12=0,\" \",+SUM(D12+F12+H12+J12)/K12)","v":0}]
[{"$f":"+Calendar!B43","v":"Jane"},null,{"$f":"+IF($A13=0,\" \",+$C$12)","v":3},null,{"$f":"+IF($A13=0,\" \",+$E$12)","v":3},null,{"$f":"+IF($A13=0,\" \",+$G$12)","v":4},null,{"$f":"+IF($A13=0,\" \",+$I$12)","v":2},null,{"$f":"+IF(A13=0,\" \",+C13+E13+G13+I13)","v":12},{"$f":"+IF(A13=0,\" \",+SUM(D13+F13+H13+J13)/K13)","v":0}]
[{"$f":"+Calendar!B44","v":"Freddy"},null,{"$f":"+IF($A14=0,\" \",+$C$12)","v":3},null,{"$f":"+IF($A14=0,\" \",+$E$12)","v":3},null,{"$f":"+IF($A14=0,\" \",+$G$12)","v":4},null,{"$f":"+IF($A14=0,\" \",+$I$12)","v":2},null,12,0]
[{"$f":"+Calendar!B45","v":"George"},null,3,null,3,null,4,null,2,null,12,0]
[{"$f":"+Calendar!B46","v":"Bungle"},null,3,null,3,null,4,null,2,null,12,0]
[{"$f":"+Calendar!B47","v":"Zippy"},null,3,null,3,null,4,null,2,null,12,0]
[{"$f":"+Calendar!B48","v":"Mathew"},null,3,null,3,null,4,null,2,null,12,0]
[{"$f":"+Calendar!B49","v":"Sooty"},null,3,null,3,null,4,null,2,null,12,0]
[{"$f":"+Calendar!B50","v":"Sweep"},null,3,null,3,null,4,null,2,null,12,0]
[{"$f":"+Calendar!B51","v":"Sue"},null,3,null,3,null,4,null,2,null,12,0]
[]
[]
[]
[null,null,null,"ene","feb","mar","abr"]
[]
[null,{"$f":"+A12","v":"Rod"},null,{"$f":"+D12/C12","v":0},{"$f":"+F12/E12","v":0},{"$f":"+H12/G12","v":0},{"$f":"+J12/I12","v":0}]
[null,"Jane",null,0,0,0,0]
[null,"Freddy",null,0,0,0,0]
[null,"George",null,0,0,0,0]
[null,"Bungle",null,0,0,0,0]
[null,"Zippy",null,0,0,0,0]
[null,"Mathew",null,{"$f":"+D18/C18","v":0},{"$f":"+F18/E18","v":0},{"$f":"+H18/G18","v":0},{"$f":"+J18/I18","v":0}]
[null,"Sooty",null,{"$f":"+D19/C19","v":0},{"$f":"+F19/E19","v":0},{"$f":"+H19/G19","v":0},{"$f":"+J19/I19","v":0}]
[null,"Sweep",null,0,0,0,0]
[null,"Sue",null,0,0,0,0]
[]
[]
[{"$f":"TRANSPOSE(B25:G36)","v":0},0,"Rod","Jane","Freddy","George","Bungle","Zippy","Mathew","Sooty","Sweep","Sue"]
[0,0,0,0,0,0,0,0,0,0,0,0]
["ene",0,0,0,0,0,0,0,0,0,0,0]
["feb",0,0,0,0,0,0,0,0,0,0,0]
["mar",0,0,0,0,0,0,0,0,0,0,0]
["abr",0,0,0,0,0,0,0,0,0,0,0]

{"sheet":"EOT2 Asis ","index":20,"n_rows":44,"n_cols":12,"rows_kept":44,"cut":false,"hidden":true,"merged":[[8,4,8,5],[14,0,14,1],[15,0,15,1],[16,0,16,1],[17,0,17,1],[9,0,9,1],[8,10,8,11],[0,10,1,11],[2,0,2,2],[3,0,4,2],[3,9,4,11],[5,0,5,2],[5,3,5,5],[5,6,5,8],[8,6,8,7],[8,8,8,9],[0,0,1,2],[0,9,1,9],[6,0,6,2],[8,2,8,3],[6,3,6,5],[6,6,6,8],[35,1,35,2],[27,1,27,2],[28,1,28,2],[29,1,29,2],[30,1,30,2],[31,1,31,2],[32,1,32,2],[33,1,33,2],[34,1,34,2],[26,1,26,2],[10,0,10,1],[11,0,11,1],[12,0,12,1],[13,0,13,1],[19,0,19,1],[20,0,20,1],[18,0,18,1]]}
["Cliente",null,null,null,null,null,null,null,null,"Mes",{"$f":"+'Obj2'!K1:L2","v":"abr - jun"}]
[]
[{"$f":"+Calendar!A5","v":"Rainbow Inc"}]
["Dirección",null,null,null,null,null,null,null,null,"Horario"]
[]
[{"$f":"+Calendar!AI2","v":"Toy street 1"},null,null,"Grupo / nivel",null,null,"Profesor",null,null,"Dias",{"$f":"+Calendar!AI12","v":"Martes"},{"$f":"+Calendar!AI14","v":"Jueves"}]
[{"$f":"+Calendar!AI3","v":"Barcelona"},null,null,{"$f":"+Calendar!Q5","v":"E1 - A1-1 Basico"},null,null,{"$f":"+Calendar!AI21","v":"Chris"},null,null,"Hora",{"$f":"+Calendar!AI17","v":"16:30:00"},{"$f":"+Calendar!AI18","v":"18:30:00"}]
[]
[null,null,{"$f":"+abrF!K1","v":"2019-04-01"},null,{"$f":"+mayF!K1","v":"2019-05-01"},null,{"$f":"+junF!K1","v":"2019-06-01"},null,{"$f":"+julF!K1","v":"2019-07-01"},null,"Total"]
["Estudiante",null,"Clases","Presente","Clases","Presente","Clases","Presente","Clases","Presente","Clases","Presente %"]
[]
[{"$f":"+Calendar!B42","v":"Rod"},null,3,null,3,null,4,null,2,null,{"$f":"+IF(A12=0,\" \",+C12+E12+G12+I12)","v":12},{"$f":"+IF(A12=0,\" \",+SUM(D12+F12+H12+J12)/K12)","v":0}]
[{"$f":"+Calendar!B43","v":"Jane"},null,{"$f":"+IF($A13=0,\" \",+$C$12)","v":3},null,{"$f":"+IF($A13=0,\" \",+$E$12)","v":3},null,{"$f":"+IF($A13=0,\" \",+$G$12)","v":4},null,{"$f":"+IF($A13=0,\" \",+$I$12)","v":2},null,{"$f":"+IF(A13=0,\" \",+C13+E13+G13+I13)","v":12},{"$f":"+IF(A13=0,\" \",+SUM(D13+F13+H13+J13)/K13)","v":0}]
[{"$f":"+Calendar!B44","v":"Freddy"},null,{"$f":"+IF($A14=0,\" \",+$C$12)","v":3},null,{"$f":"+IF($A14=0,\" \",+$E$12)","v":3},null,{"$f":"+IF($A14=0,\" \",+$G$12)","v":4},null,{"$f":"+IF($A14=0,\" \",+$I$12)","v":2},null,12,0]
[{"$f":"+Calendar!B45","v":"George"},null,3,null,3,null,4,null,2,null,12,0]
[{"$f":"+Calendar!B46","v":"Bungle"},null,3,null,3,null,4,null,2,null,12,0]
[{"$f":"+Calendar!B47","v":"Zippy"},null,3,null,3,null,4,null,2,null,12,0]
[{"$f":"+Calendar!B48","v":"Mathew"},null,3,null,3,null,4,null,2,null,12,0]
[{"$f":"+Calendar!B49","v":"Sooty"},null,3,null,3,null,4,null,2,null,12,0]
[{"$f":"+Calendar!B50","v":"Sweep"},null,3,null,3,null,4,null,2,null,12,0]
[{"$f":"+Calendar!B51","v":"Sue"},null,3,null,3,null,4,null,2,null,12,0]
[]
[]
[]
[null,null,null,"abr","may","jun","jul"]
[]
[null,{"$f":"+A12","v":"Rod"},null,{"$f":"+D12/C12","v":0},{"$f":"+F12/E12","v":0},{"$f":"+H12/G12","v":0},{"$f":"+J12/I12","v":0}]
[null,"Jane",null,0,0,0,0]
[null,"Freddy",null,0,0,0,0]
[null,"George",null,0,0,0,0]
[null,"Bungle",null,0,0,0,0]
[null,"Zippy",null,0,0,0,0]
[null,"Mathew",null,{"$f":"+D18/C18","v":0},{"$f":"+F18/E18","v":0},{"$f":"+H18/G18","v":0},{"$f":"+J18/I18","v":0}]
[null,"Sooty",null,{"$f":"+D19/C19","v":0},{"$f":"+F19/E19","v":0},{"$f":"+H19/G19","v":0},{"$f":"+J19/I19","v":0}]
[null,"Sweep",null,0,0,0,0]
[null,"Sue",null,0,0,0,0]
[]
[]
[{"$f":"TRANSPOSE(B25:G36)","v":0},0,"Rod","Jane","Freddy","George","Bungle","Zippy","Mathew","Sooty","Sweep","Sue"]
[0,0,0,0,0,0,0,0,0,0,0,0]
["abr",0,0,0,0,0,0,0,0,0,0,0]
["may",0,0,0,0,0,0,0,0,0,0,0]
["jun",0,0,0,0,0,0,0,0,0,0,0]
["jul",0,0,0,0,0,0,0,0,0,0,0]

{"sheet":"EOT3 Asis","index":21,"n_rows":44,"n_cols":12,"rows_kept":44,"cut":false,"hidden":true,"merged":[[8,4,8,5],[14,0,14,1],[15,0,15,1],[16,0,16,1],[17,0,17,1],[9,0,9,1],[8,10,8,11],[0,10,1,11],[2,0,2,2],[3,0,4,2],[3,9,4,11],[5,0,5,2],[5,3,5,5],[5,6,5,8],[8,6,8,7],[8,8,8,9],[0,0,1,2],[0,9,1,9],[6,0,6,2],[8,2,8,3],[6,3,6,5],[6,6,6,8],[35,1,35,2],[27,1,27,2],[28,1,28,2],[29,1,29,2],[30,1,30,2],[31,1,31,2],[32,1,32,2],[33,1,33,2],[34,1,34,2],[26,1,26,2],[10,0,10,1],[11,0,11,1],[12,0,12,1],[13,0,13,1],[19,0,19,1],[20,0,20,1],[18,0,18,1]]}
["Cliente",null,null,null,null,null,null,null,null,"Mes",{"$f":"+'Obj3'!K1:L2","v":"sep - dic"}]
[]
[{"$f":"+Calendar!A5","v":"Rainbow Inc"}]
["Dirección",null,null,null,null,null,null,null,null,"Horario"]
[]
[{"$f":"+Calendar!AI2","v":"Toy street 1"},null,null,"Grupo / nivel",null,null,"Profesor",null,null,"Dias",{"$f":"+Calendar!AI12","v":"Martes"},{"$f":"+Calendar!AI14","v":"Jueves"}]
[{"$f":"+Calendar!AI3","v":"Barcelona"},null,null,{"$f":"+Calendar!Q5","v":"E1 - A1-1 Basico"},null,null,{"$f":"+Calendar!AI21","v":"Chris"},null,null,"Hora",{"$f":"+Calendar!AI17","v":"16:30:00"},{"$f":"+Calendar!AI18","v":"18:30:00"}]
[]
[null,null,{"$f":"+sepF!K1","v":"2019-09-01"},null,{"$f":"+octF!K1","v":"2019-10-01"},null,{"$f":"+novF!K1","v":"2019-11-01"},null,{"$f":"+dicF!K1","v":"2019-12-01"},null,"Total"]
["Estudiante",null,"Clases","Presente","Clases","Presente","Clases","Presente","Clases","Presente","Clases","Presente %"]
[]
[{"$f":"+Calendar!B42","v":"Rod"},null,3,null,3,null,4,null,2,null,{"$f":"+IF(A12=0,\" \",+C12+E12+G12+I12)","v":12},{"$f":"+IF(A12=0,\" \",+SUM(D12+F12+H12+J12)/K12)","v":0}]
[{"$f":"+Calendar!B43","v":"Jane"},null,{"$f":"+IF($A13=0,\" \",+$C$12)","v":3},null,{"$f":"+IF($A13=0,\" \",+$E$12)","v":3},null,{"$f":"+IF($A13=0,\" \",+$G$12)","v":4},null,{"$f":"+IF($A13=0,\" \",+$I$12)","v":2},null,{"$f":"+IF(A13=0,\" \",+C13+E13+G13+I13)","v":12},{"$f":"+IF(A13=0,\" \",+SUM(D13+F13+H13+J13)/K13)","v":0}]
[{"$f":"+Calendar!B44","v":"Freddy"},null,{"$f":"+IF($A14=0,\" \",+$C$12)","v":3},null,{"$f":"+IF($A14=0,\" \",+$E$12)","v":3},null,{"$f":"+IF($A14=0,\" \",+$G$12)","v":4},null,{"$f":"+IF($A14=0,\" \",+$I$12)","v":2},null,12,0]
[{"$f":"+Calendar!B45","v":"George"},null,3,null,3,null,4,null,2,null,12,0]
[{"$f":"+Calendar!B46","v":"Bungle"},null,3,null,3,null,4,null,2,null,12,0]
[{"$f":"+Calendar!B47","v":"Zippy"},null,3,null,3,null,4,null,2,null,12,0]
[{"$f":"+Calendar!B48","v":"Mathew"},null,3,null,3,null,4,null,2,null,12,0]
[{"$f":"+Calendar!B49","v":"Sooty"},null,3,null,3,null,4,null,2,null,12,0]
[{"$f":"+Calendar!B50","v":"Sweep"},null,3,null,3,null,4,null,2,null,12,0]
[{"$f":"+Calendar!B51","v":"Sue"},null,3,null,3,null,4,null,2,null,12,0]
[]
[]
[]
[null,null,null,"sep","oct","nov","dic"]
[]
[null,{"$f":"+A12","v":"Rod"},null,{"$f":"+D12/C12","v":0},{"$f":"+F12/E12","v":0},{"$f":"+H12/G12","v":0},{"$f":"+J12/I12","v":0}]
[null,"Jane",null,0,0,0,0]
[null,"Freddy",null,0,0,0,0]
[null,"George",null,0,0,0,0]
[null,"Bungle",null,0,0,0,0]
[null,"Zippy",null,0,0,0,0]
[null,"Mathew",null,{"$f":"+D18/C18","v":0},{"$f":"+F18/E18","v":0},{"$f":"+H18/G18","v":0},{"$f":"+J18/I18","v":0}]
[null,"Sooty",null,{"$f":"+D19/C19","v":0},{"$f":"+F19/E19","v":0},{"$f":"+H19/G19","v":0},{"$f":"+J19/I19","v":0}]
[null,"Sweep",null,0,0,0,0]
[null,"Sue",null,0,0,0,0]
[]
[]
[{"$f":"TRANSPOSE(B25:G36)","v":0},0,"Rod","Jane","Freddy","George","Bungle","Zippy","Mathew","Sooty","Sweep","Sue"]
[0,0,0,0,0,0,0,0,0,0,0,0]
["sep",0,0,0,0,0,0,0,0,0,0,0]
["oct",0,0,0,0,0,0,0,0,0,0,0]
["nov",0,0,0,0,0,0,0,0,0,0,0]
["dic",0,0,0,0,0,0,0,0,0,0,0]

{"sheet":"Calculations","index":22,"n_rows":303,"n_cols":17,"rows_kept":303,"cut":false,"hidden":true,"merged":[]}
["From:",{"$f":"+Calendar!AI8","v":"2019-01-08"},{"$f":"+Calendar!AL7","v":"2019-01-10"}]
["To:",{"$f":"+Calendar!AI9","v":"2019-12-19"},{"$f":"+Calendar!AL8","v":"2019-12-19"},null,"All_dates",null,null,1,2,3,4,5,6,7,8,9,10]
[null,null,null,null,null,null,"Month"]
[null,{"$f":"IF(B$1=\"\",\"\",B$1)","v":"2019-01-08"},{"$f":"IF(C$1=\"\",\"\",C$1)","v":"2019-01-10"},null,{"$f":"INDEX($B$4:$C$100,INT((ROWS($1:1)-1)/2)+1,MOD(ROWS($1:1)-1,2)+1)","v":"2019-01-08"},{"$f":"IF(E4=\"\",\"\",MONTH(E4)&\"_\"&COUNTIF(F$3:F3,MONTH(E4)&\"_*\")+1)","v":"1_1"},1,{"$f":"IFERROR(INDEX($E:$E,MATCH($G4&\"_\"&COLUMNS($H:H),$F:$F,0)),\"\")","v":"2019-01-08"},{"$f":"IFERROR(INDEX($E:$E,MATCH($G4&\"_\"&COLUMNS($H:I),$F:$F,0)),\"\")","v":"2019-01-10"},{"$f":"IFERROR(INDEX($E:$E,MATCH($G4&\"_\"&COLUMNS($H:J),$F:$F,0)),\"\")","v":"2019-01-15"},{"$f":"IFERROR(INDEX($E:$E,MATCH($G4&\"_\"&COLUMNS($H:K),$F:$F,0)),\"\")","v":"2019-01-17"},{"$f":"IFERROR(INDEX($E:$E,MATCH($G4&\"_\"&COLUMNS($H:L),$F:$F,0)),\"\")","v":"2019-01-22"},{"$f":"IFERROR(INDEX($E:$E,MATCH($G4&\"_\"&COLUMNS($H:M),$F:$F,0)),\"\")","v":"2019-01-24"},{"$f":"IFERROR(INDEX($E:$E,MATCH($G4&\"_\"&COLUMNS($H:N),$F:$F,0)),\"\")","v":"2019-01-29"},{"$f":"IFERROR(INDEX($E:$E,MATCH($G4&\"_\"&COLUMNS($H:O),$F:$F,0)),\"\")","v":"2019-01-31"},{"$f":"IFERROR(INDEX($E:$E,MATCH($G4&\"_\"&COLUMNS($H:P),$F:$F,0)),\"\")","v":""},{"$f":"IFERROR(INDEX($E:$E,MATCH($G4&\"_\"&COLUMNS($H:Q),$F:$F,0)),\"\")","v":""}]
[null,{"$f":"IF(B4=\"\",\"\",IF(B4+7<=B$2,B4+7,\"\"))","v":"2019-01-15"},{"$f":"IF(C4=\"\",\"\",IF(C4+7<=C$2,C4+7,\"\"))","v":"2019-01-17"},null,{"$f":"INDEX($B$4:$C$100,INT((ROWS($1:2)-1)/2)+1,MOD(ROWS($1:2)-1,2)+1)","v":"2019-01-10"},{"$f":"IF(E5=\"\",\"\",MONTH(E5)&\"_\"&COUNTIF(F$3:F4,MONTH(E5)&\"_*\")+1)","v":"1_2"},2,{"$f":"IFERROR(INDEX($E:$E,MATCH($G5&\"_\"&COLUMNS($H:H),$F:$F,0)),\"\")","v":"2019-02-05"},{"$f":"IFERROR(INDEX($E:$E,MATCH($G5&\"_\"&COLUMNS($H:I),$F:$F,0)),\"\")","v":"2019-02-07"},{"$f":"IFERROR(INDEX($E:$E,MATCH($G5&\"_\"&COLUMNS($H:J),$F:$F,0)),\"\")","v":"2019-02-12"},{"$f":"IFERROR(INDEX($E:$E,MATCH($G5&\"_\"&COLUMNS($H:K),$F:$F,0)),\"\")","v":"2019-02-14"},{"$f":"IFERROR(INDEX($E:$E,MATCH($G5&\"_\"&COLUMNS($H:L),$F:$F,0)),\"\")","v":"2019-02-19"},{"$f":"IFERROR(INDEX($E:$E,MATCH($G5&\"_\"&COLUMNS($H:M),$F:$F,0)),\"\")","v":"2019-02-21"},{"$f":"IFERROR(INDEX($E:$E,MATCH($G5&\"_\"&COLUMNS($H:N),$F:$F,0)),\"\")","v":"2019-02-26"},{"$f":"IFERROR(INDEX($E:$E,MATCH($G5&\"_\"&COLUMNS($H:O),$F:$F,0)),\"\")","v":"2019-02-28"},{"$f":"IFERROR(INDEX($E:$E,MATCH($G5&\"_\"&COLUMNS($H:P),$F:$F,0)),\"\")","v":""},{"$f":"IFERROR(INDEX($E:$E,MATCH($G5&\"_\"&COLUMNS($H:Q),$F:$F,0)),\"\")","v":""}]
[null,{"$f":"IF(B5=\"\",\"\",IF(B5+7<=B$2,B5+7,\"\"))","v":"2019-01-22"},"2019-01-24",null,{"$f":"INDEX($B$4:$C$100,INT((ROWS($1:3)-1)/2)+1,MOD(ROWS($1:3)-1,2)+1)","v":"2019-01-15"},{"$f":"IF(E6=\"\",\"\",MONTH(E6)&\"_\"&COUNTIF(F$3:F5,MONTH(E6)&\"_*\")+1)","v":"1_3"},3,{"$f":"IFERROR(INDEX($E:$E,MATCH($G6&\"_\"&COLUMNS($H:H),$F:$F,0)),\"\")","v":"2019-03-05"},{"$f":"IFERROR(INDEX($E:$E,MATCH($G6&\"_\"&COLUMNS($H:I),$F:$F,0)),\"\")","v":"2019-03-07"},{"$f":"IFERROR(INDEX($E:$E,MATCH($G6&\"_\"&COLUMNS($H:J),$F:$F,0)),\"\")","v":"2019-03-12"},{"$f":"IFERROR(INDEX($E:$E,MATCH($G6&\"_\"&COLUMNS($H:K),$F:$F,0)),\"\")","v":"2019-03-14"},{"$f":"IFERROR(INDEX($E:$E,MATCH($G6&\"_\"&COLUMNS($H:L),$F:$F,0)),\"\")","v":"2019-03-19"},{"$f":"IFERROR(INDEX($E:$E,MATCH($G6&\"_\"&COLUMNS($H:M),$F:$F,0)),\"\")","v":"2019-03-21"},{"$f":"IFERROR(INDEX($E:$E,MATCH($G6&\"_\"&COLUMNS($H:N),$F:$F,0)),\"\")","v":"2019-03-26"},{"$f":"IFERROR(INDEX($E:$E,MATCH($G6&\"_\"&COLUMNS($H:O),$F:$F,0)),\"\")","v":"2019-03-28"},{"$f":"IFERROR(INDEX($E:$E,MATCH($G6&\"_\"&COLUMNS($H:P),$F:$F,0)),\"\")","v":""},{"$f":"IFERROR(INDEX($E:$E,MATCH($G6&\"_\"&COLUMNS($H:Q),$F:$F,0)),\"\")","v":""}]
[null,"2019-01-29","2019-01-31",null,{"$f":"INDEX($B$4:$C$100,INT((ROWS($1:4)-1)/2)+1,MOD(ROWS($1:4)-1,2)+1)","v":"2019-01-17"},{"$f":"IF(E7=\"\",\"\",MONTH(E7)&\"_\"&COUNTIF(F$3:F6,MONTH(E7)&\"_*\")+1)","v":"1_4"},4,{"$f":"IFERROR(INDEX($E:$E,MATCH($G7&\"_\"&COLUMNS($H:H),$F:$F,0)),\"\")","v":"2019-04-02"},{"$f":"IFERROR(INDEX($E:$E,MATCH($G7&\"_\"&COLUMNS($H:I),$F:$F,0)),\"\")","v":"2019-04-04"},{"$f":"IFERROR(INDEX($E:$E,MATCH($G7&\"_\"&COLUMNS($H:J),$F:$F,0)),\"\")","v":"2019-04-09"},{"$f":"IFERROR(INDEX($E:$E,MATCH($G7&\"_\"&COLUMNS($H:K),$F:$F,0)),\"\")","v":"2019-04-11"},{"$f":"IFERROR(INDEX($E:$E,MATCH($G7&\"_\"&COLUMNS($H:L),$F:$F,0)),\"\")","v":"2019-04-16"},{"$f":"IFERROR(INDEX($E:$E,MATCH($G7&\"_\"&COLUMNS($H:M),$F:$F,0)),\"\")","v":"2019-04-18"},{"$f":"IFERROR(INDEX($E:$E,MATCH($G7&\"_\"&COLUMNS($H:N),$F:$F,0)),\"\")","v":"2019-04-23"},{"$f":"IFERROR(INDEX($E:$E,MATCH($G7&\"_\"&COLUMNS($H:O),$F:$F,0)),\"\")","v":"2019-04-25"},{"$f":"IFERROR(INDEX($E:$E,MATCH($G7&\"_\"&COLUMNS($H:P),$F:$F,0)),\"\")","v":"2019-04-30"},{"$f":"IFERROR(INDEX($E:$E,MATCH($G7&\"_\"&COLUMNS($H:Q),$F:$F,0)),\"\")","v":""}]
[null,"2019-02-05","2019-02-07",null,{"$f":"INDEX($B$4:$C$100,INT((ROWS($1:5)-1)/2)+1,MOD(ROWS($1:5)-1,2)+1)","v":"2019-01-22"},{"$f":"IF(E8=\"\",\"\",MONTH(E8)&\"_\"&COUNTIF(F$3:F7,MONTH(E8)&\"_*\")+1)","v":"1_5"},5,{"$f":"IFERROR(INDEX($E:$E,MATCH($G8&\"_\"&COLUMNS($H:H),$F:$F,0)),\"\")","v":"2019-05-02"},{"$f":"IFERROR(INDEX($E:$E,MATCH($G8&\"_\"&COLUMNS($H:I),$F:$F,0)),\"\")","v":"2019-05-07"},{"$f":"IFERROR(INDEX($E:$E,MATCH($G8&\"_\"&COLUMNS($H:J),$F:$F,0)),\"\")","v":"2019-05-09"},{"$f":"IFERROR(INDEX($E:$E,MATCH($G8&\"_\"&COLUMNS($H:K),$F:$F,0)),\"\")","v":"2019-05-14"},{"$f":"IFERROR(INDEX($E:$E,MATCH($G8&\"_\"&COLUMNS($H:L),$F:$F,0)),\"\")","v":"2019-05-16"},{"$f":"IFERROR(INDEX($E:$E,MATCH($G8&\"_\"&COLUMNS($H:M),$F:$F,0)),\"\")","v":"2019-05-21"},{"$f":"IFERROR(INDEX($E:$E,MATCH($G8&\"_\"&COLUMNS($H:N),$F:$F,0)),\"\")","v":"2019-05-23"},{"$f":"IFERROR(INDEX($E:$E,MATCH($G8&\"_\"&COLUMNS($H:O),$F:$F,0)),\"\")","v":"2019-05-28"},{"$f":"IFERROR(INDEX($E:$E,MATCH($G8&\"_\"&COLUMNS($H:P),$F:$F,0)),\"\")","v":"2019-05-30"},{"$f":"IFERROR(INDEX($E:$E,MATCH($G8&\"_\"&COLUMNS($H:Q),$F:$F,0)),\"\")","v":""}]
[null,"2019-02-12","2019-02-14",null,{"$f":"INDEX($B$4:$C$100,INT((ROWS($1:6)-1)/2)+1,MOD(ROWS($1:6)-1,2)+1)","v":"2019-01-24"},{"$f":"IF(E9=\"\",\"\",MONTH(E9)&\"_\"&COUNTIF(F$3:F8,MONTH(E9)&\"_*\")+1)","v":"1_6"},6,{"$f":"IFERROR(INDEX($E:$E,MATCH($G9&\"_\"&COLUMNS($H:H),$F:$F,0)),\"\")","v":"2019-06-04"},{"$f":"IFERROR(INDEX($E:$E,MATCH($G9&\"_\"&COLUMNS($H:I),$F:$F,0)),\"\")","v":"2019-06-06"},{"$f":"IFERROR(INDEX($E:$E,MATCH($G9&\"_\"&COLUMNS($H:J),$F:$F,0)),\"\")","v":"2019-06-11"},{"$f":"IFERROR(INDEX($E:$E,MATCH($G9&\"_\"&COLUMNS($H:K),$F:$F,0)),\"\")","v":"2019-06-13"},{"$f":"IFERROR(INDEX($E:$E,MATCH($G9&\"_\"&COLUMNS($H:L),$F:$F,0)),\"\")","v":"2019-06-18"},{"$f":"IFERROR(INDEX($E:$E,MATCH($G9&\"_\"&COLUMNS($H:M),$F:$F,0)),\"\")","v":"2019-06-20"},{"$f":"IFERROR(INDEX($E:$E,MATCH($G9&\"_\"&COLUMNS($H:N),$F:$F,0)),\"\")","v":"2019-06-25"},{"$f":"IFERROR(INDEX($E:$E,MATCH($G9&\"_\"&COLUMNS($H:O),$F:$F,0)),\"\")","v":"2019-06-27"},{"$f":"IFERROR(INDEX($E:$E,MATCH($G9&\"_\"&COLUMNS($H:P),$F:$F,0)),\"\")","v":""},{"$f":"IFERROR(INDEX($E:$E,MATCH($G9&\"_\"&COLUMNS($H:Q),$F:$F,0)),\"\")","v":""}]
[null,"2019-02-19","2019-02-21",null,{"$f":"INDEX($B$4:$C$100,INT((ROWS($1:7)-1)/2)+1,MOD(ROWS($1:7)-1,2)+1)","v":"2019-01-29"},{"$f":"IF(E10=\"\",\"\",MONTH(E10)&\"_\"&COUNTIF(F$3:F9,MONTH(E10)&\"_*\")+1)","v":"1_7"},7,{"$f":"IFERROR(INDEX($E:$E,MATCH($G10&\"_\"&COLUMNS($H:H),$F:$F,0)),\"\")","v":"2019-07-02"},{"$f":"IFERROR(INDEX($E:$E,MATCH($G10&\"_\"&COLUMNS($H:I),$F:$F,0)),\"\")","v":"2019-07-04"},{"$f":"IFERROR(INDEX($E:$E,MATCH($G10&\"_\"&COLUMNS($H:J),$F:$F,0)),\"\")","v":"2019-07-09"},{"$f":"IFERROR(INDEX($E:$E,MATCH($G10&\"_\"&COLUMNS($H:K),$F:$F,0)),\"\")","v":"2019-07-11"},{"$f":"IFERROR(INDEX($E:$E,MATCH($G10&\"_\"&COLUMNS($H:L),$F:$F,0)),\"\")","v":"2019-07-16"},{"$f":"IFERROR(INDEX($E:$E,MATCH($G10&\"_\"&COLUMNS($H:M),$F:$F,0)),\"\")","v":"2019-07-18"},{"$f":"IFERROR(INDEX($E:$E,MATCH($G10&\"_\"&COLUMNS($H:N),$F:$F,0)),\"\")","v":"2019-07-23"},{"$f":"IFERROR(INDEX($E:$E,MATCH($G10&\"_\"&COLUMNS($H:O),$F:$F,0)),\"\")","v":"2019-07-25"},{"$f":"IFERROR(INDEX($E:$E,MATCH($G10&\"_\"&COLUMNS($H:P),$F:$F,0)),\"\")","v":"2019-07-30"},{"$f":"IFERROR(INDEX($E:$E,MATCH($G10&\"_\"&COLUMNS($H:Q),$F:$F,0)),\"\")","v":""}]
[null,"2019-02-26","2019-02-28",null,{"$f":"INDEX($B$4:$C$100,INT((ROWS($1:8)-1)/2)+1,MOD(ROWS($1:8)-1,2)+1)","v":"2019-01-31"},{"$f":"IF(E11=\"\",\"\",MONTH(E11)&\"_\"&COUNTIF(F$3:F10,MONTH(E11)&\"_*\")+1)","v":"1_8"},8,{"$f":"IFERROR(INDEX($E:$E,MATCH($G11&\"_\"&COLUMNS($H:H),$F:$F,0)),\"\")","v":"2019-08-01"},{"$f":"IFERROR(INDEX($E:$E,MATCH($G11&\"_\"&COLUMNS($H:I),$F:$F,0)),\"\")","v":"2019-08-06"},{"$f":"IFERROR(INDEX($E:$E,MATCH($G11&\"_\"&COLUMNS($H:J),$F:$F,0)),\"\")","v":"2019-08-08"},{"$f":"IFERROR(INDEX($E:$E,MATCH($G11&\"_\"&COLUMNS($H:K),$F:$F,0)),\"\")","v":"2019-08-13"},{"$f":"IFERROR(INDEX($E:$E,MATCH($G11&\"_\"&COLUMNS($H:L),$F:$F,0)),\"\")","v":"2019-08-15"},{"$f":"IFERROR(INDEX($E:$E,MATCH($G11&\"_\"&COLUMNS($H:M),$F:$F,0)),\"\")","v":"2019-08-20"},{"$f":"IFERROR(INDEX($E:$E,MATCH($G11&\"_\"&COLUMNS($H:N),$F:$F,0)),\"\")","v":"2019-08-22"},{"$f":"IFERROR(INDEX($E:$E,MATCH($G11&\"_\"&COLUMNS($H:O),$F:$F,0)),\"\")","v":"2019-08-27"},{"$f":"IFERROR(INDEX($E:$E,MATCH($G11&\"_\"&COLUMNS($H:P),$F:$F,0)),\"\")","v":"2019-08-29"},{"$f":"IFERROR(INDEX($E:$E,MATCH($G11&\"_\"&COLUMNS($H:Q),$F:$F,0)),\"\")","v":""}]
[null,"2019-03-05","2019-03-07",null,{"$f":"INDEX($B$4:$C$100,INT((ROWS($1:9)-1)/2)+1,MOD(ROWS($1:9)-1,2)+1)","v":"2019-02-05"},{"$f":"IF(E12=\"\",\"\",MONTH(E12)&\"_\"&COUNTIF(F$3:F11,MONTH(E12)&\"_*\")+1)","v":"2_1"},9,{"$f":"IFERROR(INDEX($E:$E,MATCH($G12&\"_\"&COLUMNS($H:H),$F:$F,0)),\"\")","v":"2019-09-03"},{"$f":"IFERROR(INDEX($E:$E,MATCH($G12&\"_\"&COLUMNS($H:I),$F:$F,0)),\"\")","v":"2019-09-05"},{"$f":"IFERROR(INDEX($E:$E,MATCH($G12&\"_\"&COLUMNS($H:J),$F:$F,0)),\"\")","v":"2019-09-10"},{"$f":"IFERROR(INDEX($E:$E,MATCH($G12&\"_\"&COLUMNS($H:K),$F:$F,0)),\"\")","v":"2019-09-12"},{"$f":"IFERROR(INDEX($E:$E,MATCH($G12&\"_\"&COLUMNS($H:L),$F:$F,0)),\"\")","v":"2019-09-17"},{"$f":"IFERROR(INDEX($E:$E,MATCH($G12&\"_\"&COLUMNS($H:M),$F:$F,0)),\"\")","v":"2019-09-19"},{"$f":"IFERROR(INDEX($E:$E,MATCH($G12&\"_\"&COLUMNS($H:N),$F:$F,0)),\"\")","v":"2019-09-24"},{"$f":"IFERROR(INDEX($E:$E,MATCH($G12&\"_\"&COLUMNS($H:O),$F:$F,0)),\"\")","v":"2019-09-26"},{"$f":"IFERROR(INDEX($E:$E,MATCH($G12&\"_\"&COLUMNS($H:P),$F:$F,0)),\"\")","v":""},{"$f":"IFERROR(INDEX($E:$E,MATCH($G12&\"_\"&COLUMNS($H:Q),$F:$F,0)),\"\")","v":""}]
[null,"2019-03-12","2019-03-14",null,{"$f":"INDEX($B$4:$C$100,INT((ROWS($1:10)-1)/2)+1,MOD(ROWS($1:10)-1,2)+1)","v":"2019-02-07"},{"$f":"IF(E13=\"\",\"\",MONTH(E13)&\"_\"&COUNTIF(F$3:F12,MONTH(E13)&\"_*\")+1)","v":"2_2"},10,{"$f":"IFERROR(INDEX($E:$E,MATCH($G13&\"_\"&COLUMNS($H:H),$F:$F,0)),\"\")","v":"2019-10-01"},{"$f":"IFERROR(INDEX($E:$E,MATCH($G13&\"_\"&COLUMNS($H:I),$F:$F,0)),\"\")","v":"2019-10-03"},{"$f":"IFERROR(INDEX($E:$E,MATCH($G13&\"_\"&COLUMNS($H:J),$F:$F,0)),\"\")","v":"2019-10-08"},{"$f":"IFERROR(INDEX($E:$E,MATCH($G13&\"_\"&COLUMNS($H:K),$F:$F,0)),\"\")","v":"2019-10-10"},{"$f":"IFERROR(INDEX($E:$E,MATCH($G13&\"_\"&COLUMNS($H:L),$F:$F,0)),\"\")","v":"2019-10-15"},{"$f":"IFERROR(INDEX($E:$E,MATCH($G13&\"_\"&COLUMNS($H:M),$F:$F,0)),\"\")","v":"2019-10-17"},{"$f":"IFERROR(INDEX($E:$E,MATCH($G13&\"_\"&COLUMNS($H:N),$F:$F,0)),\"\")","v":"2019-10-22"},{"$f":"IFERROR(INDEX($E:$E,MATCH($G13&\"_\"&COLUMNS($H:O),$F:$F,0)),\"\")","v":"2019-10-24"},{"$f":"IFERROR(INDEX($E:$E,MATCH($G13&\"_\"&COLUMNS($H:P),$F:$F,0)),\"\")","v":"2019-10-29"},{"$f":"IFERROR(INDEX($E:$E,MATCH($G13&\"_\"&COLUMNS($H:Q),$F:$F,0)),\"\")","v":"2019-10-31"}]
[null,"2019-03-19","2019-03-21",null,{"$f":"INDEX($B$4:$C$100,INT((ROWS($1:11)-1)/2)+1,MOD(ROWS($1:11)-1,2)+1)","v":"2019-02-12"},{"$f":"IF(E14=\"\",\"\",MONTH(E14)&\"_\"&COUNTIF(F$3:F13,MONTH(E14)&\"_*\")+1)","v":"2_3"},11,{"$f":"IFERROR(INDEX($E:$E,MATCH($G14&\"_\"&COLUMNS($H:H),$F:$F,0)),\"\")","v":"2019-11-05"},{"$f":"IFERROR(INDEX($E:$E,MATCH($G14&\"_\"&COLUMNS($H:I),$F:$F,0)),\"\")","v":"2019-11-07"},{"$f":"IFERROR(INDEX($E:$E,MATCH($G14&\"_\"&COLUMNS($H:J),$F:$F,0)),\"\")","v":"2019-11-12"},{"$f":"IFERROR(INDEX($E:$E,MATCH($G14&\"_\"&COLUMNS($H:K),$F:$F,0)),\"\")","v":"2019-11-14"},{"$f":"IFERROR(INDEX($E:$E,MATCH($G14&\"_\"&COLUMNS($H:L),$F:$F,0)),\"\")","v":"2019-11-19"},{"$f":"IFERROR(INDEX($E:$E,MATCH($G14&\"_\"&COLUMNS($H:M),$F:$F,0)),\"\")","v":"2019-11-21"},{"$f":"IFERROR(INDEX($E:$E,MATCH($G14&\"_\"&COLUMNS($H:N),$F:$F,0)),\"\")","v":"2019-11-26"},{"$f":"IFERROR(INDEX($E:$E,MATCH($G14&\"_\"&COLUMNS($H:O),$F:$F,0)),\"\")","v":"2019-11-28"},{"$f":"IFERROR(INDEX($E:$E,MATCH($G14&\"_\"&COLUMNS($H:P),$F:$F,0)),\"\")","v":""},{"$f":"IFERROR(INDEX($E:$E,MATCH($G14&\"_\"&COLUMNS($H:Q),$F:$F,0)),\"\")","v":""}]
[null,"2019-03-26","2019-03-28",null,{"$f":"INDEX($B$4:$C$100,INT((ROWS($1:12)-1)/2)+1,MOD(ROWS($1:12)-1,2)+1)","v":"2019-02-14"},{"$f":"IF(E15=\"\",\"\",MONTH(E15)&\"_\"&COUNTIF(F$3:F14,MONTH(E15)&\"_*\")+1)","v":"2_4"},12,{"$f":"IFERROR(INDEX($E:$E,MATCH($G15&\"_\"&COLUMNS($H:H),$F:$F,0)),\"\")","v":"2019-12-03"},{"$f":"IFERROR(INDEX($E:$E,MATCH($G15&\"_\"&COLUMNS($H:I),$F:$F,0)),\"\")","v":"2019-12-05"},{"$f":"IFERROR(INDEX($E:$E,MATCH($G15&\"_\"&COLUMNS($H:J),$F:$F,0)),\"\")","v":"2019-12-10"},{"$f":"IFERROR(INDEX($E:$E,MATCH($G15&\"_\"&COLUMNS($H:K),$F:$F,0)),\"\")","v":"2019-12-12"},{"$f":"IFERROR(INDEX($E:$E,MATCH($G15&\"_\"&COLUMNS($H:L),$F:$F,0)),\"\")","v":"2019-12-17"},{"$f":"IFERROR(INDEX($E:$E,MATCH($G15&\"_\"&COLUMNS($H:M),$F:$F,0)),\"\")","v":"2019-12-19"},{"$f":"IFERROR(INDEX($E:$E,MATCH($G15&\"_\"&COLUMNS($H:N),$F:$F,0)),\"\")","v":""},{"$f":"IFERROR(INDEX($E:$E,MATCH($G15&\"_\"&COLUMNS($H:O),$F:$F,0)),\"\")","v":""},{"$f":"IFERROR(INDEX($E:$E,MATCH($G15&\"_\"&COLUMNS($H:P),$F:$F,0)),\"\")","v":""},{"$f":"IFERROR(INDEX($E:$E,MATCH($G15&\"_\"&COLUMNS($H:Q),$F:$F,0)),\"\")","v":""}]
[null,"2019-04-02","2019-04-04",null,{"$f":"INDEX($B$4:$C$100,INT((ROWS($1:13)-1)/2)+1,MOD(ROWS($1:13)-1,2)+1)","v":"2019-02-19"},{"$f":"IF(E16=\"\",\"\",MONTH(E16)&\"_\"&COUNTIF(F$3:F15,MONTH(E16)&\"_*\")+1)","v":"2_5"}]
[null,"2019-04-09","2019-04-11",null,{"$f":"INDEX($B$4:$C$100,INT((ROWS($1:14)-1)/2)+1,MOD(ROWS($1:14)-1,2)+1)","v":"2019-02-21"},{"$f":"IF(E17=\"\",\"\",MONTH(E17)&\"_\"&COUNTIF(F$3:F16,MONTH(E17)&\"_*\")+1)","v":"2_6"}]
[null,"2019-04-16","2019-04-18",null,{"$f":"INDEX($B$4:$C$100,INT((ROWS($1:15)-1)/2)+1,MOD(ROWS($1:15)-1,2)+1)","v":"2019-02-26"},{"$f":"IF(E18=\"\",\"\",MONTH(E18)&\"_\"&COUNTIF(F$3:F17,MONTH(E18)&\"_*\")+1)","v":"2_7"}]
[null,"2019-04-23","2019-04-25",null,{"$f":"INDEX($B$4:$C$100,INT((ROWS($1:16)-1)/2)+1,MOD(ROWS($1:16)-1,2)+1)","v":"2019-02-28"},{"$f":"IF(E19=\"\",\"\",MONTH(E19)&\"_\"&COUNTIF(F$3:F18,MONTH(E19)&\"_*\")+1)","v":"2_8"}]
[null,"2019-04-30","2019-05-02",null,{"$f":"INDEX($B$4:$C$100,INT((ROWS($1:17)-1)/2)+1,MOD(ROWS($1:17)-1,2)+1)","v":"2019-03-05"},{"$f":"IF(E20=\"\",\"\",MONTH(E20)&\"_\"&COUNTIF(F$3:F19,MONTH(E20)&\"_*\")+1)","v":"3_1"}]
[null,"2019-05-07","2019-05-09",null,{"$f":"INDEX($B$4:$C$100,INT((ROWS($1:18)-1)/2)+1,MOD(ROWS($1:18)-1,2)+1)","v":"2019-03-07"},{"$f":"IF(E21=\"\",\"\",MONTH(E21)&\"_\"&COUNTIF(F$3:F20,MONTH(E21)&\"_*\")+1)","v":"3_2"}]
[null,{"$f":"IF(B21=\"\",\"\",IF(B21+7<=B$2,B21+7,\"\"))","v":"2019-05-14"},"2019-05-16",null,{"$f":"INDEX($B$4:$C$100,INT((ROWS($1:19)-1)/2)+1,MOD(ROWS($1:19)-1,2)+1)","v":"2019-03-12"},{"$f":"IF(E22=\"\",\"\",MONTH(E22)&\"_\"&COUNTIF(F$3:F21,MONTH(E22)&\"_*\")+1)","v":"3_3"}]
[null,"2019-05-21","2019-05-23",null,{"$f":"INDEX($B$4:$C$100,INT((ROWS($1:20)-1)/2)+1,MOD(ROWS($1:20)-1,2)+1)","v":"2019-03-14"},{"$f":"IF(E23=\"\",\"\",MONTH(E23)&\"_\"&COUNTIF(F$3:F22,MONTH(E23)&\"_*\")+1)","v":"3_4"}]
[null,"2019-05-28","2019-05-30",null,{"$f":"INDEX($B$4:$C$100,INT((ROWS($1:21)-1)/2)+1,MOD(ROWS($1:21)-1,2)+1)","v":"2019-03-19"},{"$f":"IF(E24=\"\",\"\",MONTH(E24)&\"_\"&COUNTIF(F$3:F23,MONTH(E24)&\"_*\")+1)","v":"3_5"}]
[null,"2019-06-04","2019-06-06",null,{"$f":"INDEX($B$4:$C$100,INT((ROWS($1:22)-1)/2)+1,MOD(ROWS($1:22)-1,2)+1)","v":"2019-03-21"},{"$f":"IF(E25=\"\",\"\",MONTH(E25)&\"_\"&COUNTIF(F$3:F24,MONTH(E25)&\"_*\")+1)","v":"3_6"}]
[null,"2019-06-11","2019-06-13",null,{"$f":"INDEX($B$4:$C$100,INT((ROWS($1:23)-1)/2)+1,MOD(ROWS($1:23)-1,2)+1)","v":"2019-03-26"},{"$f":"IF(E26=\"\",\"\",MONTH(E26)&\"_\"&COUNTIF(F$3:F25,MONTH(E26)&\"_*\")+1)","v":"3_7"}]
[null,"2019-06-18","2019-06-20",null,{"$f":"INDEX($B$4:$C$100,INT((ROWS($1:24)-1)/2)+1,MOD(ROWS($1:24)-1,2)+1)","v":"2019-03-28"},{"$f":"IF(E27=\"\",\"\",MONTH(E27)&\"_\"&COUNTIF(F$3:F26,MONTH(E27)&\"_*\")+1)","v":"3_8"}]
[null,"2019-06-25","2019-06-27",null,{"$f":"INDEX($B$4:$C$100,INT((ROWS($1:25)-1)/2)+1,MOD(ROWS($1:25)-1,2)+1)","v":"2019-04-02"},{"$f":"IF(E28=\"\",\"\",MONTH(E28)&\"_\"&COUNTIF(F$3:F27,MONTH(E28)&\"_*\")+1)","v":"4_1"}]
[null,"2019-07-02","2019-07-04",null,{"$f":"INDEX($B$4:$C$100,INT((ROWS($1:26)-1)/2)+1,MOD(ROWS($1:26)-1,2)+1)","v":"2019-04-04"},{"$f":"IF(E29=\"\",\"\",MONTH(E29)&\"_\"&COUNTIF(F$3:F28,MONTH(E29)&\"_*\")+1)","v":"4_2"}]
[null,"2019-07-09","2019-07-11",null,{"$f":"INDEX($B$4:$C$100,INT((ROWS($1:27)-1)/2)+1,MOD(ROWS($1:27)-1,2)+1)","v":"2019-04-09"},{"$f":"IF(E30=\"\",\"\",MONTH(E30)&\"_\"&COUNTIF(F$3:F29,MONTH(E30)&\"_*\")+1)","v":"4_3"}]
[null,"2019-07-16","2019-07-18",null,{"$f":"INDEX($B$4:$C$100,INT((ROWS($1:28)-1)/2)+1,MOD(ROWS($1:28)-1,2)+1)","v":"2019-04-11"},{"$f":"IF(E31=\"\",\"\",MONTH(E31)&\"_\"&COUNTIF(F$3:F30,MONTH(E31)&\"_*\")+1)","v":"4_4"}]
[null,"2019-07-23","2019-07-25",null,{"$f":"INDEX($B$4:$C$100,INT((ROWS($1:29)-1)/2)+1,MOD(ROWS($1:29)-1,2)+1)","v":"2019-04-16"},{"$f":"IF(E32=\"\",\"\",MONTH(E32)&\"_\"&COUNTIF(F$3:F31,MONTH(E32)&\"_*\")+1)","v":"4_5"}]
[null,"2019-07-30","2019-08-01",null,{"$f":"INDEX($B$4:$C$100,INT((ROWS($1:30)-1)/2)+1,MOD(ROWS($1:30)-1,2)+1)","v":"2019-04-18"},{"$f":"IF(E33=\"\",\"\",MONTH(E33)&\"_\"&COUNTIF(F$3:F32,MONTH(E33)&\"_*\")+1)","v":"4_6"}]
[null,"2019-08-06","2019-08-08",null,{"$f":"INDEX($B$4:$C$100,INT((ROWS($1:31)-1)/2)+1,MOD(ROWS($1:31)-1,2)+1)","v":"2019-04-23"},{"$f":"IF(E34=\"\",\"\",MONTH(E34)&\"_\"&COUNTIF(F$3:F33,MONTH(E34)&\"_*\")+1)","v":"4_7"}]
[null,"2019-08-13","2019-08-15",null,{"$f":"INDEX($B$4:$C$100,INT((ROWS($1:32)-1)/2)+1,MOD(ROWS($1:32)-1,2)+1)","v":"2019-04-25"},{"$f":"IF(E35=\"\",\"\",MONTH(E35)&\"_\"&COUNTIF(F$3:F34,MONTH(E35)&\"_*\")+1)","v":"4_8"}]
[null,"2019-08-20","2019-08-22",null,{"$f":"INDEX($B$4:$C$100,INT((ROWS($1:33)-1)/2)+1,MOD(ROWS($1:33)-1,2)+1)","v":"2019-04-30"},{"$f":"IF(E36=\"\",\"\",MONTH(E36)&\"_\"&COUNTIF(F$3:F35,MONTH(E36)&\"_*\")+1)","v":"4_9"}]
[null,"2019-08-27","2019-08-29",null,{"$f":"INDEX($B$4:$C$100,INT((ROWS($1:34)-1)/2)+1,MOD(ROWS($1:34)-1,2)+1)","v":"2019-05-02"},{"$f":"IF(E37=\"\",\"\",MONTH(E37)&\"_\"&COUNTIF(F$3:F36,MONTH(E37)&\"_*\")+1)","v":"5_1"}]
[null,{"$f":"IF(B37=\"\",\"\",IF(B37+7<=B$2,B37+7,\"\"))","v":"2019-09-03"},"2019-09-05",null,{"$f":"INDEX($B$4:$C$100,INT((ROWS($1:35)-1)/2)+1,MOD(ROWS($1:35)-1,2)+1)","v":"2019-05-07"},{"$f":"IF(E38=\"\",\"\",MONTH(E38)&\"_\"&COUNTIF(F$3:F37,MONTH(E38)&\"_*\")+1)","v":"5_2"}]
[null,"2019-09-10","2019-09-12",null,{"$f":"INDEX($B$4:$C$100,INT((ROWS($1:36)-1)/2)+1,MOD(ROWS($1:36)-1,2)+1)","v":"2019-05-09"},{"$f":"IF(E39=\"\",\"\",MONTH(E39)&\"_\"&COUNTIF(F$3:F38,MONTH(E39)&\"_*\")+1)","v":"5_3"}]
[null,"2019-09-17","2019-09-19",null,{"$f":"INDEX($B$4:$C$100,INT((ROWS($1:37)-1)/2)+1,MOD(ROWS($1:37)-1,2)+1)","v":"2019-05-14"},{"$f":"IF(E40=\"\",\"\",MONTH(E40)&\"_\"&COUNTIF(F$3:F39,MONTH(E40)&\"_*\")+1)","v":"5_4"}]
[null,{"$f":"IF(B40=\"\",\"\",IF(B40+7<=B$2,B40+7,\"\"))","v":"2019-09-24"},"2019-09-26",null,{"$f":"INDEX($B$4:$C$100,INT((ROWS($1:38)-1)/2)+1,MOD(ROWS($1:38)-1,2)+1)","v":"2019-05-16"},{"$f":"IF(E41=\"\",\"\",MONTH(E41)&\"_\"&COUNTIF(F$3:F40,MONTH(E41)&\"_*\")+1)","v":"5_5"}]
[null,{"$f":"IF(B41=\"\",\"\",IF(B41+7<=B$2,B41+7,\"\"))","v":"2019-10-01"},"2019-10-03",null,{"$f":"INDEX($B$4:$C$100,INT((ROWS($1:39)-1)/2)+1,MOD(ROWS($1:39)-1,2)+1)","v":"2019-05-21"},{"$f":"IF(E42=\"\",\"\",MONTH(E42)&\"_\"&COUNTIF(F$3:F41,MONTH(E42)&\"_*\")+1)","v":"5_6"}]
[null,{"$f":"IF(B42=\"\",\"\",IF(B42+7<=B$2,B42+7,\"\"))","v":"2019-10-08"},"2019-10-10",null,{"$f":"INDEX($B$4:$C$100,INT((ROWS($1:40)-1)/2)+1,MOD(ROWS($1:40)-1,2)+1)","v":"2019-05-23"},{"$f":"IF(E43=\"\",\"\",MONTH(E43)&\"_\"&COUNTIF(F$3:F42,MONTH(E43)&\"_*\")+1)","v":"5_7"}]
[null,{"$f":"IF(B43=\"\",\"\",IF(B43+7<=B$2,B43+7,\"\"))","v":"2019-10-15"},"2019-10-17",null,{"$f":"INDEX($B$4:$C$100,INT((ROWS($1:41)-1)/2)+1,MOD(ROWS($1:41)-1,2)+1)","v":"2019-05-28"},{"$f":"IF(E44=\"\",\"\",MONTH(E44)&\"_\"&COUNTIF(F$3:F43,MONTH(E44)&\"_*\")+1)","v":"5_8"}]
[null,{"$f":"IF(B44=\"\",\"\",IF(B44+7<=B$2,B44+7,\"\"))","v":"2019-10-22"},"2019-10-24",null,{"$f":"INDEX($B$4:$C$100,INT((ROWS($1:42)-1)/2)+1,MOD(ROWS($1:42)-1,2)+1)","v":"2019-05-30"},{"$f":"IF(E45=\"\",\"\",MONTH(E45)&\"_\"&COUNTIF(F$3:F44,MONTH(E45)&\"_*\")+1)","v":"5_9"}]
[null,{"$f":"IF(B45=\"\",\"\",IF(B45+7<=B$2,B45+7,\"\"))","v":"2019-10-29"},"2019-10-31",null,{"$f":"INDEX($B$4:$C$100,INT((ROWS($1:43)-1)/2)+1,MOD(ROWS($1:43)-1,2)+1)","v":"2019-06-04"},{"$f":"IF(E46=\"\",\"\",MONTH(E46)&\"_\"&COUNTIF(F$3:F45,MONTH(E46)&\"_*\")+1)","v":"6_1"}]
[null,{"$f":"IF(B46=\"\",\"\",IF(B46+7<=B$2,B46+7,\"\"))","v":"2019-11-05"},"2019-11-07",null,{"$f":"INDEX($B$4:$C$100,INT((ROWS($1:44)-1)/2)+1,MOD(ROWS($1:44)-1,2)+1)","v":"2019-06-06"},{"$f":"IF(E47=\"\",\"\",MONTH(E47)&\"_\"&COUNTIF(F$3:F46,MONTH(E47)&\"_*\")+1)","v":"6_2"}]
[null,{"$f":"IF(B47=\"\",\"\",IF(B47+7<=B$2,B47+7,\"\"))","v":"2019-11-12"},"2019-11-14",null,{"$f":"INDEX($B$4:$C$100,INT((ROWS($1:45)-1)/2)+1,MOD(ROWS($1:45)-1,2)+1)","v":"2019-06-11"},{"$f":"IF(E48=\"\",\"\",MONTH(E48)&\"_\"&COUNTIF(F$3:F47,MONTH(E48)&\"_*\")+1)","v":"6_3"}]
[null,{"$f":"IF(B48=\"\",\"\",IF(B48+7<=B$2,B48+7,\"\"))","v":"2019-11-19"},"2019-11-21",null,{"$f":"INDEX($B$4:$C$100,INT((ROWS($1:46)-1)/2)+1,MOD(ROWS($1:46)-1,2)+1)","v":"2019-06-13"},{"$f":"IF(E49=\"\",\"\",MONTH(E49)&\"_\"&COUNTIF(F$3:F48,MONTH(E49)&\"_*\")+1)","v":"6_4"}]
[null,{"$f":"IF(B49=\"\",\"\",IF(B49+7<=B$2,B49+7,\"\"))","v":"2019-11-26"},"2019-11-28",null,{"$f":"INDEX($B$4:$C$100,INT((ROWS($1:47)-1)/2)+1,MOD(ROWS($1:47)-1,2)+1)","v":"2019-06-18"},{"$f":"IF(E50=\"\",\"\",MONTH(E50)&\"_\"&COUNTIF(F$3:F49,MONTH(E50)&\"_*\")+1)","v":"6_5"}]
[null,{"$f":"IF(B50=\"\",\"\",IF(B50+7<=B$2,B50+7,\"\"))","v":"2019-12-03"},"2019-12-05",null,{"$f":"INDEX($B$4:$C$100,INT((ROWS($1:48)-1)/2)+1,MOD(ROWS($1:48)-1,2)+1)","v":"2019-06-20"},{"$f":"IF(E51=\"\",\"\",MONTH(E51)&\"_\"&COUNTIF(F$3:F50,MONTH(E51)&\"_*\")+1)","v":"6_6"}]
[null,{"$f":"IF(B51=\"\",\"\",IF(B51+7<=B$2,B51+7,\"\"))","v":"2019-12-10"},"2019-12-12",null,{"$f":"INDEX($B$4:$C$100,INT((ROWS($1:49)-1)/2)+1,MOD(ROWS($1:49)-1,2)+1)","v":"2019-06-25"},{"$f":"IF(E52=\"\",\"\",MONTH(E52)&\"_\"&COUNTIF(F$3:F51,MONTH(E52)&\"_*\")+1)","v":"6_7"}]
[null,{"$f":"IF(B52=\"\",\"\",IF(B52+7<=B$2,B52+7,\"\"))","v":"2019-12-17"},"2019-12-19",null,{"$f":"INDEX($B$4:$C$100,INT((ROWS($1:50)-1)/2)+1,MOD(ROWS($1:50)-1,2)+1)","v":"2019-06-27"},{"$f":"IF(E53=\"\",\"\",MONTH(E53)&\"_\"&COUNTIF(F$3:F52,MONTH(E53)&\"_*\")+1)","v":"6_8"}]
[null,{"$f":"IF(B53=\"\",\"\",IF(B53+7<=B$2,B53+7,\"\"))","v":""},"",null,{"$f":"INDEX($B$4:$C$100,INT((ROWS($1:51)-1)/2)+1,MOD(ROWS($1:51)-1,2)+1)","v":"2019-07-02"},{"$f":"IF(E54=\"\",\"\",MONTH(E54)&\"_\"&COUNTIF(F$3:F53,MONTH(E54)&\"_*\")+1)","v":"7_1"}]
[null,{"$f":"IF(B54=\"\",\"\",IF(B54+7<=B$2,B54+7,\"\"))","v":""},"",null,{"$f":"INDEX($B$4:$C$100,INT((ROWS($1:52)-1)/2)+1,MOD(ROWS($1:52)-1,2)+1)","v":"2019-07-04"},{"$f":"IF(E55=\"\",\"\",MONTH(E55)&\"_\"&COUNTIF(F$3:F54,MONTH(E55)&\"_*\")+1)","v":"7_2"}]
[null,{"$f":"IF(B55=\"\",\"\",IF(B55+7<=B$2,B55+7,\"\"))","v":""},"",null,{"$f":"INDEX($B$4:$C$100,INT((ROWS($1:53)-1)/2)+1,MOD(ROWS($1:53)-1,2)+1)","v":"2019-07-09"},{"$f":"IF(E56=\"\",\"\",MONTH(E56)&\"_\"&COUNTIF(F$3:F55,MONTH(E56)&\"_*\")+1)","v":"7_3"}]
[null,{"$f":"IF(B56=\"\",\"\",IF(B56+7<=B$2,B56+7,\"\"))","v":""},"",null,{"$f":"INDEX($B$4:$C$100,INT((ROWS($1:54)-1)/2)+1,MOD(ROWS($1:54)-1,2)+1)","v":"2019-07-11"},{"$f":"IF(E57=\"\",\"\",MONTH(E57)&\"_\"&COUNTIF(F$3:F56,MONTH(E57)&\"_*\")+1)","v":"7_4"}]
[null,{"$f":"IF(B57=\"\",\"\",IF(B57+7<=B$2,B57+7,\"\"))","v":""},"",null,{"$f":"INDEX($B$4:$C$100,INT((ROWS($1:55)-1)/2)+1,MOD(ROWS($1:55)-1,2)+1)","v":"2019-07-16"},{"$f":"IF(E58=\"\",\"\",MONTH(E58)&\"_\"&COUNTIF(F$3:F57,MONTH(E58)&\"_*\")+1)","v":"7_5"}]
[null,{"$f":"IF(B58=\"\",\"\",IF(B58+7<=B$2,B58+7,\"\"))","v":""},"",null,{"$f":"INDEX($B$4:$C$100,INT((ROWS($1:56)-1)/2)+1,MOD(ROWS($1:56)-1,2)+1)","v":"2019-07-18"},{"$f":"IF(E59=\"\",\"\",MONTH(E59)&\"_\"&COUNTIF(F$3:F58,MONTH(E59)&\"_*\")+1)","v":"7_6"}]
[null,{"$f":"IF(B59=\"\",\"\",IF(B59+7<=B$2,B59+7,\"\"))","v":""},"",null,{"$f":"INDEX($B$4:$C$100,INT((ROWS($1:57)-1)/2)+1,MOD(ROWS($1:57)-1,2)+1)","v":"2019-07-23"},{"$f":"IF(E60=\"\",\"\",MONTH(E60)&\"_\"&COUNTIF(F$3:F59,MONTH(E60)&\"_*\")+1)","v":"7_7"}]
[null,{"$f":"IF(B60=\"\",\"\",IF(B60+7<=B$2,B60+7,\"\"))","v":""},"",null,{"$f":"INDEX($B$4:$C$100,INT((ROWS($1:58)-1)/2)+1,MOD(ROWS($1:58)-1,2)+1)","v":"2019-07-25"},{"$f":"IF(E61=\"\",\"\",MONTH(E61)&\"_\"&COUNTIF(F$3:F60,MONTH(E61)&\"_*\")+1)","v":"7_8"}]
[null,{"$f":"IF(B61=\"\",\"\",IF(B61+7<=B$2,B61+7,\"\"))","v":""},"",null,{"$f":"INDEX($B$4:$C$100,INT((ROWS($1:59)-1)/2)+1,MOD(ROWS($1:59)-1,2)+1)","v":"2019-07-30"},{"$f":"IF(E62=\"\",\"\",MONTH(E62)&\"_\"&COUNTIF(F$3:F61,MONTH(E62)&\"_*\")+1)","v":"7_9"}]
[null,{"$f":"IF(B62=\"\",\"\",IF(B62+7<=B$2,B62+7,\"\"))","v":""},"",null,{"$f":"INDEX($B$4:$C$100,INT((ROWS($1:60)-1)/2)+1,MOD(ROWS($1:60)-1,2)+1)","v":"2019-08-01"},{"$f":"IF(E63=\"\",\"\",MONTH(E63)&\"_\"&COUNTIF(F$3:F62,MONTH(E63)&\"_*\")+1)","v":"8_1"}]
[null,{"$f":"IF(B63=\"\",\"\",IF(B63+7<=B$2,B63+7,\"\"))","v":""},"",null,{"$f":"INDEX($B$4:$C$100,INT((ROWS($1:61)-1)/2)+1,MOD(ROWS($1:61)-1,2)+1)","v":"2019-08-06"},{"$f":"IF(E64=\"\",\"\",MONTH(E64)&\"_\"&COUNTIF(F$3:F63,MONTH(E64)&\"_*\")+1)","v":"8_2"}]
[null,{"$f":"IF(B64=\"\",\"\",IF(B64+7<=B$2,B64+7,\"\"))","v":""},"",null,{"$f":"INDEX($B$4:$C$100,INT((ROWS($1:62)-1)/2)+1,MOD(ROWS($1:62)-1,2)+1)","v":"2019-08-08"},{"$f":"IF(E65=\"\",\"\",MONTH(E65)&\"_\"&COUNTIF(F$3:F64,MONTH(E65)&\"_*\")+1)","v":"8_3"}]
[null,{"$f":"IF(B65=\"\",\"\",IF(B65+7<=B$2,B65+7,\"\"))","v":""},"",null,{"$f":"INDEX($B$4:$C$100,INT((ROWS($1:63)-1)/2)+1,MOD(ROWS($1:63)-1,2)+1)","v":"2019-08-13"},{"$f":"IF(E66=\"\",\"\",MONTH(E66)&\"_\"&COUNTIF(F$3:F65,MONTH(E66)&\"_*\")+1)","v":"8_4"}]
[null,{"$f":"IF(B66=\"\",\"\",IF(B66+7<=B$2,B66+7,\"\"))","v":""},"",null,{"$f":"INDEX($B$4:$C$100,INT((ROWS($1:64)-1)/2)+1,MOD(ROWS($1:64)-1,2)+1)","v":"2019-08-15"},{"$f":"IF(E67=\"\",\"\",MONTH(E67)&\"_\"&COUNTIF(F$3:F66,MONTH(E67)&\"_*\")+1)","v":"8_5"}]
[null,{"$f":"IF(B67=\"\",\"\",IF(B67+7<=B$2,B67+7,\"\"))","v":""},"",null,{"$f":"INDEX($B$4:$C$100,INT((ROWS($1:65)-1)/2)+1,MOD(ROWS($1:65)-1,2)+1)","v":"2019-08-20"},{"$f":"IF(E68=\"\",\"\",MONTH(E68)&\"_\"&COUNTIF(F$3:F67,MONTH(E68)&\"_*\")+1)","v":"8_6"}]
[null,{"$f":"IF(B68=\"\",\"\",IF(B68+7<=B$2,B68+7,\"\"))","v":""},"",null,{"$f":"INDEX($B$4:$C$100,INT((ROWS($1:66)-1)/2)+1,MOD(ROWS($1:66)-1,2)+1)","v":"2019-08-22"},{"$f":"IF(E69=\"\",\"\",MONTH(E69)&\"_\"&COUNTIF(F$3:F68,MONTH(E69)&\"_*\")+1)","v":"8_7"}]
[null,{"$f":"IF(B69=\"\",\"\",IF(B69+7<=B$2,B69+7,\"\"))","v":""},"",null,{"$f":"INDEX($B$4:$C$100,INT((ROWS($1:67)-1)/2)+1,MOD(ROWS($1:67)-1,2)+1)","v":"2019-08-27"},{"$f":"IF(E70=\"\",\"\",MONTH(E70)&\"_\"&COUNTIF(F$3:F69,MONTH(E70)&\"_*\")+1)","v":"8_8"}]
[null,{"$f":"IF(B70=\"\",\"\",IF(B70+7<=B$2,B70+7,\"\"))","v":""},"",null,{"$f":"INDEX($B$4:$C$100,INT((ROWS($1:68)-1)/2)+1,MOD(ROWS($1:68)-1,2)+1)","v":"2019-08-29"},{"$f":"IF(E71=\"\",\"\",MONTH(E71)&\"_\"&COUNTIF(F$3:F70,MONTH(E71)&\"_*\")+1)","v":"8_9"}]
[null,{"$f":"IF(B71=\"\",\"\",IF(B71+7<=B$2,B71+7,\"\"))","v":""},"",null,{"$f":"INDEX($B$4:$C$100,INT((ROWS($1:69)-1)/2)+1,MOD(ROWS($1:69)-1,2)+1)","v":"2019-09-03"},{"$f":"IF(E72=\"\",\"\",MONTH(E72)&\"_\"&COUNTIF(F$3:F71,MONTH(E72)&\"_*\")+1)","v":"9_1"}]
[null,{"$f":"IF(B72=\"\",\"\",IF(B72+7<=B$2,B72+7,\"\"))","v":""},"",null,{"$f":"INDEX($B$4:$C$100,INT((ROWS($1:70)-1)/2)+1,MOD(ROWS($1:70)-1,2)+1)","v":"2019-09-05"},{"$f":"IF(E73=\"\",\"\",MONTH(E73)&\"_\"&COUNTIF(F$3:F72,MONTH(E73)&\"_*\")+1)","v":"9_2"}]
[null,{"$f":"IF(B73=\"\",\"\",IF(B73+7<=B$2,B73+7,\"\"))","v":""},"",null,{"$f":"INDEX($B$4:$C$100,INT((ROWS($1:71)-1)/2)+1,MOD(ROWS($1:71)-1,2)+1)","v":"2019-09-10"},{"$f":"IF(E74=\"\",\"\",MONTH(E74)&\"_\"&COUNTIF(F$3:F73,MONTH(E74)&\"_*\")+1)","v":"9_3"}]
[null,{"$f":"IF(B74=\"\",\"\",IF(B74+7<=B$2,B74+7,\"\"))","v":""},"",null,{"$f":"INDEX($B$4:$C$100,INT((ROWS($1:72)-1)/2)+1,MOD(ROWS($1:72)-1,2)+1)","v":"2019-09-12"},{"$f":"IF(E75=\"\",\"\",MONTH(E75)&\"_\"&COUNTIF(F$3:F74,MONTH(E75)&\"_*\")+1)","v":"9_4"}]
[null,{"$f":"IF(B75=\"\",\"\",IF(B75+7<=B$2,B75+7,\"\"))","v":""},"",null,{"$f":"INDEX($B$4:$C$100,INT((ROWS($1:73)-1)/2)+1,MOD(ROWS($1:73)-1,2)+1)","v":"2019-09-17"},{"$f":"IF(E76=\"\",\"\",MONTH(E76)&\"_\"&COUNTIF(F$3:F75,MONTH(E76)&\"_*\")+1)","v":"9_5"}]
[null,{"$f":"IF(B76=\"\",\"\",IF(B76+7<=B$2,B76+7,\"\"))","v":""},"",null,{"$f":"INDEX($B$4:$C$100,INT((ROWS($1:74)-1)/2)+1,MOD(ROWS($1:74)-1,2)+1)","v":"2019-09-19"},{"$f":"IF(E77=\"\",\"\",MONTH(E77)&\"_\"&COUNTIF(F$3:F76,MONTH(E77)&\"_*\")+1)","v":"9_6"}]
[null,{"$f":"IF(B77=\"\",\"\",IF(B77+7<=B$2,B77+7,\"\"))","v":""},"",null,{"$f":"INDEX($B$4:$C$100,INT((ROWS($1:75)-1)/2)+1,MOD(ROWS($1:75)-1,2)+1)","v":"2019-09-24"},{"$f":"IF(E78=\"\",\"\",MONTH(E78)&\"_\"&COUNTIF(F$3:F77,MONTH(E78)&\"_*\")+1)","v":"9_7"}]
[null,{"$f":"IF(B78=\"\",\"\",IF(B78+7<=B$2,B78+7,\"\"))","v":""},"",null,{"$f":"INDEX($B$4:$C$100,INT((ROWS($1:76)-1)/2)+1,MOD(ROWS($1:76)-1,2)+1)","v":"2019-09-26"},{"$f":"IF(E79=\"\",\"\",MONTH(E79)&\"_\"&COUNTIF(F$3:F78,MONTH(E79)&\"_*\")+1)","v":"9_8"}]
[null,{"$f":"IF(B79=\"\",\"\",IF(B79+7<=B$2,B79+7,\"\"))","v":""},"",null,{"$f":"INDEX($B$4:$C$100,INT((ROWS($1:77)-1)/2)+1,MOD(ROWS($1:77)-1,2)+1)","v":"2019-10-01"},{"$f":"IF(E80=\"\",\"\",MONTH(E80)&\"_\"&COUNTIF(F$3:F79,MONTH(E80)&\"_*\")+1)","v":"10_1"}]
[null,{"$f":"IF(B80=\"\",\"\",IF(B80+7<=B$2,B80+7,\"\"))","v":""},"",null,{"$f":"INDEX($B$4:$C$100,INT((ROWS($1:78)-1)/2)+1,MOD(ROWS($1:78)-1,2)+1)","v":"2019-10-03"},{"$f":"IF(E81=\"\",\"\",MONTH(E81)&\"_\"&COUNTIF(F$3:F80,MONTH(E81)&\"_*\")+1)","v":"10_2"}]
[null,{"$f":"IF(B81=\"\",\"\",IF(B81+7<=B$2,B81+7,\"\"))","v":""},"",null,{"$f":"INDEX($B$4:$C$100,INT((ROWS($1:79)-1)/2)+1,MOD(ROWS($1:79)-1,2)+1)","v":"2019-10-08"},{"$f":"IF(E82=\"\",\"\",MONTH(E82)&\"_\"&COUNTIF(F$3:F81,MONTH(E82)&\"_*\")+1)","v":"10_3"}]
[null,{"$f":"IF(B82=\"\",\"\",IF(B82+7<=B$2,B82+7,\"\"))","v":""},"",null,{"$f":"INDEX($B$4:$C$100,INT((ROWS($1:80)-1)/2)+1,MOD(ROWS($1:80)-1,2)+1)","v":"2019-10-10"},{"$f":"IF(E83=\"\",\"\",MONTH(E83)&\"_\"&COUNTIF(F$3:F82,MONTH(E83)&\"_*\")+1)","v":"10_4"}]
[null,{"$f":"IF(B83=\"\",\"\",IF(B83+7<=B$2,B83+7,\"\"))","v":""},"",null,{"$f":"INDEX($B$4:$C$100,INT((ROWS($1:81)-1)/2)+1,MOD(ROWS($1:81)-1,2)+1)","v":"2019-10-15"},{"$f":"IF(E84=\"\",\"\",MONTH(E84)&\"_\"&COUNTIF(F$3:F83,MONTH(E84)&\"_*\")+1)","v":"10_5"}]
[null,{"$f":"IF(B84=\"\",\"\",IF(B84+7<=B$2,B84+7,\"\"))","v":""},"",null,{"$f":"INDEX($B$4:$C$100,INT((ROWS($1:82)-1)/2)+1,MOD(ROWS($1:82)-1,2)+1)","v":"2019-10-17"},{"$f":"IF(E85=\"\",\"\",MONTH(E85)&\"_\"&COUNTIF(F$3:F84,MONTH(E85)&\"_*\")+1)","v":"10_6"}]
[null,{"$f":"IF(B85=\"\",\"\",IF(B85+7<=B$2,B85+7,\"\"))","v":""},"",null,{"$f":"INDEX($B$4:$C$100,INT((ROWS($1:83)-1)/2)+1,MOD(ROWS($1:83)-1,2)+1)","v":"2019-10-22"},{"$f":"IF(E86=\"\",\"\",MONTH(E86)&\"_\"&COUNTIF(F$3:F85,MONTH(E86)&\"_*\")+1)","v":"10_7"}]
[null,{"$f":"IF(B86=\"\",\"\",IF(B86+7<=B$2,B86+7,\"\"))","v":""},"",null,{"$f":"INDEX($B$4:$C$100,INT((ROWS($1:84)-1)/2)+1,MOD(ROWS($1:84)-1,2)+1)","v":"2019-10-24"},{"$f":"IF(E87=\"\",\"\",MONTH(E87)&\"_\"&COUNTIF(F$3:F86,MONTH(E87)&\"_*\")+1)","v":"10_8"}]
[null,{"$f":"IF(B87=\"\",\"\",IF(B87+7<=B$2,B87+7,\"\"))","v":""},"",null,{"$f":"INDEX($B$4:$C$100,INT((ROWS($1:85)-1)/2)+1,MOD(ROWS($1:85)-1,2)+1)","v":"2019-10-29"},{"$f":"IF(E88=\"\",\"\",MONTH(E88)&\"_\"&COUNTIF(F$3:F87,MONTH(E88)&\"_*\")+1)","v":"10_9"}]
[null,{"$f":"IF(B88=\"\",\"\",IF(B88+7<=B$2,B88+7,\"\"))","v":""},"",null,{"$f":"INDEX($B$4:$C$100,INT((ROWS($1:86)-1)/2)+1,MOD(ROWS($1:86)-1,2)+1)","v":"2019-10-31"},{"$f":"IF(E89=\"\",\"\",MONTH(E89)&\"_\"&COUNTIF(F$3:F88,MONTH(E89)&\"_*\")+1)","v":"10_10"}]
[null,{"$f":"IF(B89=\"\",\"\",IF(B89+7<=B$2,B89+7,\"\"))","v":""},"",null,{"$f":"INDEX($B$4:$C$100,INT((ROWS($1:87)-1)/2)+1,MOD(ROWS($1:87)-1,2)+1)","v":"2019-11-05"},{"$f":"IF(E90=\"\",\"\",MONTH(E90)&\"_\"&COUNTIF(F$3:F89,MONTH(E90)&\"_*\")+1)","v":"11_1"}]
[null,{"$f":"IF(B90=\"\",\"\",IF(B90+7<=B$2,B90+7,\"\"))","v":""},"",null,{"$f":"INDEX($B$4:$C$100,INT((ROWS($1:88)-1)/2)+1,MOD(ROWS($1:88)-1,2)+1)","v":"2019-11-07"},{"$f":"IF(E91=\"\",\"\",MONTH(E91)&\"_\"&COUNTIF(F$3:F90,MONTH(E91)&\"_*\")+1)","v":"11_2"}]
[null,{"$f":"IF(B91=\"\",\"\",IF(B91+7<=B$2,B91+7,\"\"))","v":""},"",null,{"$f":"INDEX($B$4:$C$100,INT((ROWS($1:89)-1)/2)+1,MOD(ROWS($1:89)-1,2)+1)","v":"2019-11-12"},{"$f":"IF(E92=\"\",\"\",MONTH(E92)&\"_\"&COUNTIF(F$3:F91,MONTH(E92)&\"_*\")+1)","v":"11_3"}]
[null,{"$f":"IF(B92=\"\",\"\",IF(B92+7<=B$2,B92+7,\"\"))","v":""},"",null,{"$f":"INDEX($B$4:$C$100,INT((ROWS($1:90)-1)/2)+1,MOD(ROWS($1:90)-1,2)+1)","v":"2019-11-14"},{"$f":"IF(E93=\"\",\"\",MONTH(E93)&\"_\"&COUNTIF(F$3:F92,MONTH(E93)&\"_*\")+1)","v":"11_4"}]
[null,{"$f":"IF(B93=\"\",\"\",IF(B93+7<=B$2,B93+7,\"\"))","v":""},"",null,{"$f":"INDEX($B$4:$C$100,INT((ROWS($1:91)-1)/2)+1,MOD(ROWS($1:91)-1,2)+1)","v":"2019-11-19"},{"$f":"IF(E94=\"\",\"\",MONTH(E94)&\"_\"&COUNTIF(F$3:F93,MONTH(E94)&\"_*\")+1)","v":"11_5"}]
[null,{"$f":"IF(B94=\"\",\"\",IF(B94+7<=B$2,B94+7,\"\"))","v":""},"",null,{"$f":"INDEX($B$4:$C$100,INT((ROWS($1:92)-1)/2)+1,MOD(ROWS($1:92)-1,2)+1)","v":"2019-11-21"},{"$f":"IF(E95=\"\",\"\",MONTH(E95)&\"_\"&COUNTIF(F$3:F94,MONTH(E95)&\"_*\")+1)","v":"11_6"}]
[null,{"$f":"IF(B95=\"\",\"\",IF(B95+7<=B$2,B95+7,\"\"))","v":""},"",null,{"$f":"INDEX($B$4:$C$100,INT((ROWS($1:93)-1)/2)+1,MOD(ROWS($1:93)-1,2)+1)","v":"2019-11-26"},{"$f":"IF(E96=\"\",\"\",MONTH(E96)&\"_\"&COUNTIF(F$3:F95,MONTH(E96)&\"_*\")+1)","v":"11_7"}]
[null,{"$f":"IF(B96=\"\",\"\",IF(B96+7<=B$2,B96+7,\"\"))","v":""},"",null,{"$f":"INDEX($B$4:$C$100,INT((ROWS($1:94)-1)/2)+1,MOD(ROWS($1:94)-1,2)+1)","v":"2019-11-28"},{"$f":"IF(E97=\"\",\"\",MONTH(E97)&\"_\"&COUNTIF(F$3:F96,MONTH(E97)&\"_*\")+1)","v":"11_8"}]
[null,{"$f":"IF(B97=\"\",\"\",IF(B97+7<=B$2,B97+7,\"\"))","v":""},"",null,{"$f":"INDEX($B$4:$C$100,INT((ROWS($1:95)-1)/2)+1,MOD(ROWS($1:95)-1,2)+1)","v":"2019-12-03"},{"$f":"IF(E98=\"\",\"\",MONTH(E98)&\"_\"&COUNTIF(F$3:F97,MONTH(E98)&\"_*\")+1)","v":"12_1"}]
[null,{"$f":"IF(B98=\"\",\"\",IF(B98+7<=B$2,B98+7,\"\"))","v":""},"",null,{"$f":"INDEX($B$4:$C$100,INT((ROWS($1:96)-1)/2)+1,MOD(ROWS($1:96)-1,2)+1)","v":"2019-12-05"},{"$f":"IF(E99=\"\",\"\",MONTH(E99)&\"_\"&COUNTIF(F$3:F98,MONTH(E99)&\"_*\")+1)","v":"12_2"}]
[null,{"$f":"IF(B99=\"\",\"\",IF(B99+7<=B$2,B99+7,\"\"))","v":""},"",null,{"$f":"INDEX($B$4:$C$100,INT((ROWS($1:97)-1)/2)+1,MOD(ROWS($1:97)-1,2)+1)","v":"2019-12-10"},{"$f":"IF(E100=\"\",\"\",MONTH(E100)&\"_\"&COUNTIF(F$3:F99,MONTH(E100)&\"_*\")+1)","v":"12_3"}]
[null,{"$f":"IF(B100=\"\",\"\",IF(B100+7<=B$2,B100+7,\"\"))","v":""},"",null,{"$f":"INDEX($B$4:$C$100,INT((ROWS($1:98)-1)/2)+1,MOD(ROWS($1:98)-1,2)+1)","v":"2019-12-12"},{"$f":"IF(E101=\"\",\"\",MONTH(E101)&\"_\"&COUNTIF(F$3:F100,MONTH(E101)&\"_*\")+1)","v":"12_4"}]
[null,{"$f":"IF(B101=\"\",\"\",IF(B101+7<=B$2,B101+7,\"\"))","v":""},"",null,{"$f":"INDEX($B$4:$C$100,INT((ROWS($1:99)-1)/2)+1,MOD(ROWS($1:99)-1,2)+1)","v":"2019-12-17"},{"$f":"IF(E102=\"\",\"\",MONTH(E102)&\"_\"&COUNTIF(F$3:F101,MONTH(E102)&\"_*\")+1)","v":"12_5"}]
[null,{"$f":"IF(B102=\"\",\"\",IF(B102+7<=B$2,B102+7,\"\"))","v":""},"",null,{"$f":"INDEX($B$4:$C$100,INT((ROWS($1:100)-1)/2)+1,MOD(ROWS($1:100)-1,2)+1)","v":"2019-12-19"},{"$f":"IF(E103=\"\",\"\",MONTH(E103)&\"_\"&COUNTIF(F$3:F102,MONTH(E103)&\"_*\")+1)","v":"12_6"}]
[null,{"$f":"IF(B103=\"\",\"\",IF(B103+7<=B$2,B103+7,\"\"))","v":""},"",null,{"$f":"INDEX($B$4:$C$100,INT((ROWS($1:101)-1)/2)+1,MOD(ROWS($1:101)-1,2)+1)","v":""},{"$f":"IF(E104=\"\",\"\",MONTH(E104)&\"_\"&COUNTIF(F$3:F103,MONTH(E104)&\"_*\")+1)","v":""}]
[null,{"$f":"IF(B104=\"\",\"\",IF(B104+7<=B$2,B104+7,\"\"))","v":""},"",null,{"$f":"INDEX($B$4:$C$100,INT((ROWS($1:102)-1)/2)+1,MOD(ROWS($1:102)-1,2)+1)","v":""},{"$f":"IF(E105=\"\",\"\",MONTH(E105)&\"_\"&COUNTIF(F$3:F104,MONTH(E105)&\"_*\")+1)","v":""}]
[null,{"$f":"IF(B105=\"\",\"\",IF(B105+7<=B$2,B105+7,\"\"))","v":""},"",null,{"$f":"INDEX($B$4:$C$100,INT((ROWS($1:103)-1)/2)+1,MOD(ROWS($1:103)-1,2)+1)","v":""},{"$f":"IF(E106=\"\",\"\",MONTH(E106)&\"_\"&COUNTIF(F$3:F105,MONTH(E106)&\"_*\")+1)","v":""}]
[null,{"$f":"IF(B106=\"\",\"\",IF(B106+7<=B$2,B106+7,\"\"))","v":""},"",null,{"$f":"INDEX($B$4:$C$100,INT((ROWS($1:104)-1)/2)+1,MOD(ROWS($1:104)-1,2)+1)","v":""},{"$f":"IF(E107=\"\",\"\",MONTH(E107)&\"_\"&COUNTIF(F$3:F106,MONTH(E107)&\"_*\")+1)","v":""}]
[null,{"$f":"IF(B107=\"\",\"\",IF(B107+7<=B$2,B107+7,\"\"))","v":""},"",null,{"$f":"INDEX($B$4:$C$100,INT((ROWS($1:105)-1)/2)+1,MOD(ROWS($1:105)-1,2)+1)","v":""},{"$f":"IF(E108=\"\",\"\",MONTH(E108)&\"_\"&COUNTIF(F$3:F107,MONTH(E108)&\"_*\")+1)","v":""}]
[null,{"$f":"IF(B108=\"\",\"\",IF(B108+7<=B$2,B108+7,\"\"))","v":""},"",null,{"$f":"INDEX($B$4:$C$100,INT((ROWS($1:106)-1)/2)+1,MOD(ROWS($1:106)-1,2)+1)","v":""},{"$f":"IF(E109=\"\",\"\",MONTH(E109)&\"_\"&COUNTIF(F$3:F108,MONTH(E109)&\"_*\")+1)","v":""}]
[null,{"$f":"IF(B109=\"\",\"\",IF(B109+7<=B$2,B109+7,\"\"))","v":""},"",null,{"$f":"INDEX($B$4:$C$100,INT((ROWS($1:107)-1)/2)+1,MOD(ROWS($1:107)-1,2)+1)","v":""},{"$f":"IF(E110=\"\",\"\",MONTH(E110)&\"_\"&COUNTIF(F$3:F109,MONTH(E110)&\"_*\")+1)","v":""}]
[null,{"$f":"IF(B110=\"\",\"\",IF(B110+7<=B$2,B110+7,\"\"))","v":""},"",null,{"$f":"INDEX($B$4:$C$100,INT((ROWS($1:108)-1)/2)+1,MOD(ROWS($1:108)-1,2)+1)","v":""},{"$f":"IF(E111=\"\",\"\",MONTH(E111)&\"_\"&COUNTIF(F$3:F110,MONTH(E111)&\"_*\")+1)","v":""}]
[null,{"$f":"IF(B111=\"\",\"\",IF(B111+7<=B$2,B111+7,\"\"))","v":""},"",null,{"$f":"INDEX($B$4:$C$100,INT((ROWS($1:109)-1)/2)+1,MOD(ROWS($1:109)-1,2)+1)","v":""},{"$f":"IF(E112=\"\",\"\",MONTH(E112)&\"_\"&COUNTIF(F$3:F111,MONTH(E112)&\"_*\")+1)","v":""}]
[null,{"$f":"IF(B112=\"\",\"\",IF(B112+7<=B$2,B112+7,\"\"))","v":""},"",null,{"$f":"INDEX($B$4:$C$100,INT((ROWS($1:110)-1)/2)+1,MOD(ROWS($1:110)-1,2)+1)","v":""},{"$f":"IF(E113=\"\",\"\",MONTH(E113)&\"_\"&COUNTIF(F$3:F112,MONTH(E113)&\"_*\")+1)","v":""}]
[null,{"$f":"IF(B113=\"\",\"\",IF(B113+7<=B$2,B113+7,\"\"))","v":""},"",null,{"$f":"INDEX($B$4:$C$100,INT((ROWS($1:111)-1)/2)+1,MOD(ROWS($1:111)-1,2)+1)","v":""},{"$f":"IF(E114=\"\",\"\",MONTH(E114)&\"_\"&COUNTIF(F$3:F113,MONTH(E114)&\"_*\")+1)","v":""}]
[null,{"$f":"IF(B114=\"\",\"\",IF(B114+7<=B$2,B114+7,\"\"))","v":""},"",null,{"$f":"INDEX($B$4:$C$100,INT((ROWS($1:112)-1)/2)+1,MOD(ROWS($1:112)-1,2)+1)","v":""},{"$f":"IF(E115=\"\",\"\",MONTH(E115)&\"_\"&COUNTIF(F$3:F114,MONTH(E115)&\"_*\")+1)","v":""}]
[null,{"$f":"IF(B115=\"\",\"\",IF(B115+7<=B$2,B115+7,\"\"))","v":""},"",null,{"$f":"INDEX($B$4:$C$100,INT((ROWS($1:113)-1)/2)+1,MOD(ROWS($1:113)-1,2)+1)","v":""},{"$f":"IF(E116=\"\",\"\",MONTH(E116)&\"_\"&COUNTIF(F$3:F115,MONTH(E116)&\"_*\")+1)","v":""}]
[null,{"$f":"IF(B116=\"\",\"\",IF(B116+7<=B$2,B116+7,\"\"))","v":""},"",null,{"$f":"INDEX($B$4:$C$100,INT((ROWS($1:114)-1)/2)+1,MOD(ROWS($1:114)-1,2)+1)","v":""},{"$f":"IF(E117=\"\",\"\",MONTH(E117)&\"_\"&COUNTIF(F$3:F116,MONTH(E117)&\"_*\")+1)","v":""}]
[null,{"$f":"IF(B117=\"\",\"\",IF(B117+7<=B$2,B117+7,\"\"))","v":""},"",null,{"$f":"INDEX($B$4:$C$100,INT((ROWS($1:115)-1)/2)+1,MOD(ROWS($1:115)-1,2)+1)","v":""},{"$f":"IF(E118=\"\",\"\",MONTH(E118)&\"_\"&COUNTIF(F$3:F117,MONTH(E118)&\"_*\")+1)","v":""}]
[null,{"$f":"IF(B118=\"\",\"\",IF(B118+7<=B$2,B118+7,\"\"))","v":""},"",null,{"$f":"INDEX($B$4:$C$100,INT((ROWS($1:116)-1)/2)+1,MOD(ROWS($1:116)-1,2)+1)","v":""},{"$f":"IF(E119=\"\",\"\",MONTH(E119)&\"_\"&COUNTIF(F$3:F118,MONTH(E119)&\"_*\")+1)","v":""}]
[null,{"$f":"IF(B119=\"\",\"\",IF(B119+7<=B$2,B119+7,\"\"))","v":""},"",null,{"$f":"INDEX($B$4:$C$100,INT((ROWS($1:117)-1)/2)+1,MOD(ROWS($1:117)-1,2)+1)","v":""},{"$f":"IF(E120=\"\",\"\",MONTH(E120)&\"_\"&COUNTIF(F$3:F119,MONTH(E120)&\"_*\")+1)","v":""}]
[null,{"$f":"IF(B120=\"\",\"\",IF(B120+7<=B$2,B120+7,\"\"))","v":""},"",null,{"$f":"INDEX($B$4:$C$100,INT((ROWS($1:118)-1)/2)+1,MOD(ROWS($1:118)-1,2)+1)","v":""},{"$f":"IF(E121=\"\",\"\",MONTH(E121)&\"_\"&COUNTIF(F$3:F120,MONTH(E121)&\"_*\")+1)","v":""}]
[null,{"$f":"IF(B121=\"\",\"\",IF(B121+7<=B$2,B121+7,\"\"))","v":""},"",null,{"$f":"INDEX($B$4:$C$100,INT((ROWS($1:119)-1)/2)+1,MOD(ROWS($1:119)-1,2)+1)","v":""},{"$f":"IF(E122=\"\",\"\",MONTH(E122)&\"_\"&COUNTIF(F$3:F121,MONTH(E122)&\"_*\")+1)","v":""}]
[null,{"$f":"IF(B122=\"\",\"\",IF(B122+7<=B$2,B122+7,\"\"))","v":""},"",null,{"$f":"INDEX($B$4:$C$100,INT((ROWS($1:120)-1)/2)+1,MOD(ROWS($1:120)-1,2)+1)","v":""},{"$f":"IF(E123=\"\",\"\",MONTH(E123)&\"_\"&COUNTIF(F$3:F122,MONTH(E123)&\"_*\")+1)","v":""}]
[null,{"$f":"IF(B123=\"\",\"\",IF(B123+7<=B$2,B123+7,\"\"))","v":""},"",null,{"$f":"INDEX($B$4:$C$100,INT((ROWS($1:121)-1)/2)+1,MOD(ROWS($1:121)-1,2)+1)","v":""},{"$f":"IF(E124=\"\",\"\",MONTH(E124)&\"_\"&COUNTIF(F$3:F123,MONTH(E124)&\"_*\")+1)","v":""}]
[null,{"$f":"IF(B124=\"\",\"\",IF(B124+7<=B$2,B124+7,\"\"))","v":""},"",null,{"$f":"INDEX($B$4:$C$100,INT((ROWS($1:122)-1)/2)+1,MOD(ROWS($1:122)-1,2)+1)","v":""},{"$f":"IF(E125=\"\",\"\",MONTH(E125)&\"_\"&COUNTIF(F$3:F124,MONTH(E125)&\"_*\")+1)","v":""}]
[null,{"$f":"IF(B125=\"\",\"\",IF(B125+7<=B$2,B125+7,\"\"))","v":""},"",null,{"$f":"INDEX($B$4:$C$100,INT((ROWS($1:123)-1)/2)+1,MOD(ROWS($1:123)-1,2)+1)","v":""},{"$f":"IF(E126=\"\",\"\",MONTH(E126)&\"_\"&COUNTIF(F$3:F125,MONTH(E126)&\"_*\")+1)","v":""}]
[null,{"$f":"IF(B126=\"\",\"\",IF(B126+7<=B$2,B126+7,\"\"))","v":""},"",null,{"$f":"INDEX($B$4:$C$100,INT((ROWS($1:124)-1)/2)+1,MOD(ROWS($1:124)-1,2)+1)","v":""},{"$f":"IF(E127=\"\",\"\",MONTH(E127)&\"_\"&COUNTIF(F$3:F126,MONTH(E127)&\"_*\")+1)","v":""}]
[null,{"$f":"IF(B127=\"\",\"\",IF(B127+7<=B$2,B127+7,\"\"))","v":""},"",null,{"$f":"INDEX($B$4:$C$100,INT((ROWS($1:125)-1)/2)+1,MOD(ROWS($1:125)-1,2)+1)","v":""},{"$f":"IF(E128=\"\",\"\",MONTH(E128)&\"_\"&COUNTIF(F$3:F127,MONTH(E128)&\"_*\")+1)","v":""}]
[null,{"$f":"IF(B128=\"\",\"\",IF(B128+7<=B$2,B128+7,\"\"))","v":""},"",null,{"$f":"INDEX($B$4:$C$100,INT((ROWS($1:126)-1)/2)+1,MOD(ROWS($1:126)-1,2)+1)","v":""},{"$f":"IF(E129=\"\",\"\",MONTH(E129)&\"_\"&COUNTIF(F$3:F128,MONTH(E129)&\"_*\")+1)","v":""}]
[null,{"$f":"IF(B129=\"\",\"\",IF(B129+7<=B$2,B129+7,\"\"))","v":""},"",null,{"$f":"INDEX($B$4:$C$100,INT((ROWS($1:127)-1)/2)+1,MOD(ROWS($1:127)-1,2)+1)","v":""},{"$f":"IF(E130=\"\",\"\",MONTH(E130)&\"_\"&COUNTIF(F$3:F129,MONTH(E130)&\"_*\")+1)","v":""}]
[null,{"$f":"IF(B130=\"\",\"\",IF(B130+7<=B$2,B130+7,\"\"))","v":""},"",null,{"$f":"INDEX($B$4:$C$100,INT((ROWS($1:128)-1)/2)+1,MOD(ROWS($1:128)-1,2)+1)","v":""},{"$f":"IF(E131=\"\",\"\",MONTH(E131)&\"_\"&COUNTIF(F$3:F130,MONTH(E131)&\"_*\")+1)","v":""}]
[null,{"$f":"IF(B131=\"\",\"\",IF(B131+7<=B$2,B131+7,\"\"))","v":""},"",null,{"$f":"INDEX($B$4:$C$100,INT((ROWS($1:129)-1)/2)+1,MOD(ROWS($1:129)-1,2)+1)","v":""},{"$f":"IF(E132=\"\",\"\",MONTH(E132)&\"_\"&COUNTIF(F$3:F131,MONTH(E132)&\"_*\")+1)","v":""}]
[null,{"$f":"IF(B132=\"\",\"\",IF(B132+7<=B$2,B132+7,\"\"))","v":""},"",null,{"$f":"INDEX($B$4:$C$100,INT((ROWS($1:130)-1)/2)+1,MOD(ROWS($1:130)-1,2)+1)","v":""},{"$f":"IF(E133=\"\",\"\",MONTH(E133)&\"_\"&COUNTIF(F$3:F132,MONTH(E133)&\"_*\")+1)","v":""}]
[null,{"$f":"IF(B133=\"\",\"\",IF(B133+7<=B$2,B133+7,\"\"))","v":""},"",null,{"$f":"INDEX($B$4:$C$100,INT((ROWS($1:131)-1)/2)+1,MOD(ROWS($1:131)-1,2)+1)","v":""},{"$f":"IF(E134=\"\",\"\",MONTH(E134)&\"_\"&COUNTIF(F$3:F133,MONTH(E134)&\"_*\")+1)","v":""}]
[null,{"$f":"IF(B134=\"\",\"\",IF(B134+7<=B$2,B134+7,\"\"))","v":""},"",null,{"$f":"INDEX($B$4:$C$100,INT((ROWS($1:132)-1)/2)+1,MOD(ROWS($1:132)-1,2)+1)","v":""},{"$f":"IF(E135=\"\",\"\",MONTH(E135)&\"_\"&COUNTIF(F$3:F134,MONTH(E135)&\"_*\")+1)","v":""}]
[null,{"$f":"IF(B135=\"\",\"\",IF(B135+7<=B$2,B135+7,\"\"))","v":""},"",null,{"$f":"INDEX($B$4:$C$100,INT((ROWS($1:133)-1)/2)+1,MOD(ROWS($1:133)-1,2)+1)","v":""},{"$f":"IF(E136=\"\",\"\",MONTH(E136)&\"_\"&COUNTIF(F$3:F135,MONTH(E136)&\"_*\")+1)","v":""}]
[null,{"$f":"IF(B136=\"\",\"\",IF(B136+7<=B$2,B136+7,\"\"))","v":""},"",null,{"$f":"INDEX($B$4:$C$100,INT((ROWS($1:134)-1)/2)+1,MOD(ROWS($1:134)-1,2)+1)","v":""},{"$f":"IF(E137=\"\",\"\",MONTH(E137)&\"_\"&COUNTIF(F$3:F136,MONTH(E137)&\"_*\")+1)","v":""}]
[null,{"$f":"IF(B137=\"\",\"\",IF(B137+7<=B$2,B137+7,\"\"))","v":""},"",null,{"$f":"INDEX($B$4:$C$100,INT((ROWS($1:135)-1)/2)+1,MOD(ROWS($1:135)-1,2)+1)","v":""},{"$f":"IF(E138=\"\",\"\",MONTH(E138)&\"_\"&COUNTIF(F$3:F137,MONTH(E138)&\"_*\")+1)","v":""}]
[null,{"$f":"IF(B138=\"\",\"\",IF(B138+7<=B$2,B138+7,\"\"))","v":""},"",null,{"$f":"INDEX($B$4:$C$100,INT((ROWS($1:136)-1)/2)+1,MOD(ROWS($1:136)-1,2)+1)","v":""},{"$f":"IF(E139=\"\",\"\",MONTH(E139)&\"_\"&COUNTIF(F$3:F138,MONTH(E139)&\"_*\")+1)","v":""}]
[null,{"$f":"IF(B139=\"\",\"\",IF(B139+7<=B$2,B139+7,\"\"))","v":""},"",null,{"$f":"INDEX($B$4:$C$100,INT((ROWS($1:137)-1)/2)+1,MOD(ROWS($1:137)-1,2)+1)","v":""},{"$f":"IF(E140=\"\",\"\",MONTH(E140)&\"_\"&COUNTIF(F$3:F139,MONTH(E140)&\"_*\")+1)","v":""}]
[null,{"$f":"IF(B140=\"\",\"\",IF(B140+7<=B$2,B140+7,\"\"))","v":""},"",null,{"$f":"INDEX($B$4:$C$100,INT((ROWS($1:138)-1)/2)+1,MOD(ROWS($1:138)-1,2)+1)","v":""},{"$f":"IF(E141=\"\",\"\",MONTH(E141)&\"_\"&COUNTIF(F$3:F140,MONTH(E141)&\"_*\")+1)","v":""}]
[null,{"$f":"IF(B141=\"\",\"\",IF(B141+7<=B$2,B141+7,\"\"))","v":""},"",null,{"$f":"INDEX($B$4:$C$100,INT((ROWS($1:139)-1)/2)+1,MOD(ROWS($1:139)-1,2)+1)","v":""},{"$f":"IF(E142=\"\",\"\",MONTH(E142)&\"_\"&COUNTIF(F$3:F141,MONTH(E142)&\"_*\")+1)","v":""}]
[null,{"$f":"IF(B142=\"\",\"\",IF(B142+7<=B$2,B142+7,\"\"))","v":""},"",null,{"$f":"INDEX($B$4:$C$100,INT((ROWS($1:140)-1)/2)+1,MOD(ROWS($1:140)-1,2)+1)","v":""},{"$f":"IF(E143=\"\",\"\",MONTH(E143)&\"_\"&COUNTIF(F$3:F142,MONTH(E143)&\"_*\")+1)","v":""}]
[null,{"$f":"IF(B143=\"\",\"\",IF(B143+7<=B$2,B143+7,\"\"))","v":""},"",null,{"$f":"INDEX($B$4:$C$100,INT((ROWS($1:141)-1)/2)+1,MOD(ROWS($1:141)-1,2)+1)","v":""},{"$f":"IF(E144=\"\",\"\",MONTH(E144)&\"_\"&COUNTIF(F$3:F143,MONTH(E144)&\"_*\")+1)","v":""}]
[null,{"$f":"IF(B144=\"\",\"\",IF(B144+7<=B$2,B144+7,\"\"))","v":""},"",null,{"$f":"INDEX($B$4:$C$100,INT((ROWS($1:142)-1)/2)+1,MOD(ROWS($1:142)-1,2)+1)","v":""},{"$f":"IF(E145=\"\",\"\",MONTH(E145)&\"_\"&COUNTIF(F$3:F144,MONTH(E145)&\"_*\")+1)","v":""}]
[null,{"$f":"IF(B145=\"\",\"\",IF(B145+7<=B$2,B145+7,\"\"))","v":""},"",null,{"$f":"INDEX($B$4:$C$100,INT((ROWS($1:143)-1)/2)+1,MOD(ROWS($1:143)-1,2)+1)","v":""},{"$f":"IF(E146=\"\",\"\",MONTH(E146)&\"_\"&COUNTIF(F$3:F145,MONTH(E146)&\"_*\")+1)","v":""}]
[null,{"$f":"IF(B146=\"\",\"\",IF(B146+7<=B$2,B146+7,\"\"))","v":""},"",null,{"$f":"INDEX($B$4:$C$100,INT((ROWS($1:144)-1)/2)+1,MOD(ROWS($1:144)-1,2)+1)","v":""},{"$f":"IF(E147=\"\",\"\",MONTH(E147)&\"_\"&COUNTIF(F$3:F146,MONTH(E147)&\"_*\")+1)","v":""}]
[null,{"$f":"IF(B147=\"\",\"\",IF(B147+7<=B$2,B147+7,\"\"))","v":""},"",null,{"$f":"INDEX($B$4:$C$100,INT((ROWS($1:145)-1)/2)+1,MOD(ROWS($1:145)-1,2)+1)","v":""},{"$f":"IF(E148=\"\",\"\",MONTH(E148)&\"_\"&COUNTIF(F$3:F147,MONTH(E148)&\"_*\")+1)","v":""}]
[null,{"$f":"IF(B148=\"\",\"\",IF(B148+7<=B$2,B148+7,\"\"))","v":""},"",null,{"$f":"INDEX($B$4:$C$100,INT((ROWS($1:146)-1)/2)+1,MOD(ROWS($1:146)-1,2)+1)","v":""},{"$f":"IF(E149=\"\",\"\",MONTH(E149)&\"_\"&COUNTIF(F$3:F148,MONTH(E149)&\"_*\")+1)","v":""}]
[null,{"$f":"IF(B149=\"\",\"\",IF(B149+7<=B$2,B149+7,\"\"))","v":""},"",null,{"$f":"INDEX($B$4:$C$100,INT((ROWS($1:147)-1)/2)+1,MOD(ROWS($1:147)-1,2)+1)","v":""},{"$f":"IF(E150=\"\",\"\",MONTH(E150)&\"_\"&COUNTIF(F$3:F149,MONTH(E150)&\"_*\")+1)","v":""}]
[null,{"$f":"IF(B150=\"\",\"\",IF(B150+7<=B$2,B150+7,\"\"))","v":""},"",null,{"$f":"INDEX($B$4:$C$100,INT((ROWS($1:148)-1)/2)+1,MOD(ROWS($1:148)-1,2)+1)","v":""},{"$f":"IF(E151=\"\",\"\",MONTH(E151)&\"_\"&COUNTIF(F$3:F150,MONTH(E151)&\"_*\")+1)","v":""}]
[null,{"$f":"IF(B151=\"\",\"\",IF(B151+7<=B$2,B151+7,\"\"))","v":""},"",null,{"$f":"INDEX($B$4:$C$100,INT((ROWS($1:149)-1)/2)+1,MOD(ROWS($1:149)-1,2)+1)","v":""},{"$f":"IF(E152=\"\",\"\",MONTH(E152)&\"_\"&COUNTIF(F$3:F151,MONTH(E152)&\"_*\")+1)","v":""}]
[null,{"$f":"IF(B152=\"\",\"\",IF(B152+7<=B$2,B152+7,\"\"))","v":""},"",null,{"$f":"INDEX($B$4:$C$100,INT((ROWS($1:150)-1)/2)+1,MOD(ROWS($1:150)-1,2)+1)","v":""},{"$f":"IF(E153=\"\",\"\",MONTH(E153)&\"_\"&COUNTIF(F$3:F152,MONTH(E153)&\"_*\")+1)","v":""}]
[null,{"$f":"IF(B153=\"\",\"\",IF(B153+7<=B$2,B153+7,\"\"))","v":""},"",null,{"$f":"INDEX($B$4:$C$100,INT((ROWS($1:151)-1)/2)+1,MOD(ROWS($1:151)-1,2)+1)","v":""},{"$f":"IF(E154=\"\",\"\",MONTH(E154)&\"_\"&COUNTIF(F$3:F153,MONTH(E154)&\"_*\")+1)","v":""}]
[null,{"$f":"IF(B154=\"\",\"\",IF(B154+7<=B$2,B154+7,\"\"))","v":""},"",null,{"$f":"INDEX($B$4:$C$100,INT((ROWS($1:152)-1)/2)+1,MOD(ROWS($1:152)-1,2)+1)","v":""},{"$f":"IF(E155=\"\",\"\",MONTH(E155)&\"_\"&COUNTIF(F$3:F154,MONTH(E155)&\"_*\")+1)","v":""}]
[null,{"$f":"IF(B155=\"\",\"\",IF(B155+7<=B$2,B155+7,\"\"))","v":""},"",null,{"$f":"INDEX($B$4:$C$100,INT((ROWS($1:153)-1)/2)+1,MOD(ROWS($1:153)-1,2)+1)","v":""},{"$f":"IF(E156=\"\",\"\",MONTH(E156)&\"_\"&COUNTIF(F$3:F155,MONTH(E156)&\"_*\")+1)","v":""}]
[null,{"$f":"IF(B156=\"\",\"\",IF(B156+7<=B$2,B156+7,\"\"))","v":""},"",null,{"$f":"INDEX($B$4:$C$100,INT((ROWS($1:154)-1)/2)+1,MOD(ROWS($1:154)-1,2)+1)","v":""},{"$f":"IF(E157=\"\",\"\",MONTH(E157)&\"_\"&COUNTIF(F$3:F156,MONTH(E157)&\"_*\")+1)","v":""}]
[null,{"$f":"IF(B157=\"\",\"\",IF(B157+7<=B$2,B157+7,\"\"))","v":""},"",null,{"$f":"INDEX($B$4:$C$100,INT((ROWS($1:155)-1)/2)+1,MOD(ROWS($1:155)-1,2)+1)","v":""},{"$f":"IF(E158=\"\",\"\",MONTH(E158)&\"_\"&COUNTIF(F$3:F157,MONTH(E158)&\"_*\")+1)","v":""}]
[null,{"$f":"IF(B158=\"\",\"\",IF(B158+7<=B$2,B158+7,\"\"))","v":""},"",null,{"$f":"INDEX($B$4:$C$100,INT((ROWS($1:156)-1)/2)+1,MOD(ROWS($1:156)-1,2)+1)","v":""},{"$f":"IF(E159=\"\",\"\",MONTH(E159)&\"_\"&COUNTIF(F$3:F158,MONTH(E159)&\"_*\")+1)","v":""}]
[null,{"$f":"IF(B159=\"\",\"\",IF(B159+7<=B$2,B159+7,\"\"))","v":""},"",null,{"$f":"INDEX($B$4:$C$100,INT((ROWS($1:157)-1)/2)+1,MOD(ROWS($1:157)-1,2)+1)","v":""},{"$f":"IF(E160=\"\",\"\",MONTH(E160)&\"_\"&COUNTIF(F$3:F159,MONTH(E160)&\"_*\")+1)","v":""}]
[null,{"$f":"IF(B160=\"\",\"\",IF(B160+7<=B$2,B160+7,\"\"))","v":""},"",null,{"$f":"INDEX($B$4:$C$100,INT((ROWS($1:158)-1)/2)+1,MOD(ROWS($1:158)-1,2)+1)","v":""},{"$f":"IF(E161=\"\",\"\",MONTH(E161)&\"_\"&COUNTIF(F$3:F160,MONTH(E161)&\"_*\")+1)","v":""}]
[null,{"$f":"IF(B161=\"\",\"\",IF(B161+7<=B$2,B161+7,\"\"))","v":""},""]
[null,{"$f":"IF(B162=\"\",\"\",IF(B162+7<=B$2,B162+7,\"\"))","v":""},""]
[null,{"$f":"IF(B163=\"\",\"\",IF(B163+7<=B$2,B163+7,\"\"))","v":""},""]
[null,{"$f":"IF(B164=\"\",\"\",IF(B164+7<=B$2,B164+7,\"\"))","v":""},""]
[null,{"$f":"IF(B165=\"\",\"\",IF(B165+7<=B$2,B165+7,\"\"))","v":""},""]
[null,{"$f":"IF(B166=\"\",\"\",IF(B166+7<=B$2,B166+7,\"\"))","v":""},""]
[null,{"$f":"IF(B167=\"\",\"\",IF(B167+7<=B$2,B167+7,\"\"))","v":""},""]
[null,{"$f":"IF(B168=\"\",\"\",IF(B168+7<=B$2,B168+7,\"\"))","v":""},""]
[null,{"$f":"IF(B169=\"\",\"\",IF(B169+7<=B$2,B169+7,\"\"))","v":""},""]
[null,{"$f":"IF(B170=\"\",\"\",IF(B170+7<=B$2,B170+7,\"\"))","v":""},""]
[null,{"$f":"IF(B171=\"\",\"\",IF(B171+7<=B$2,B171+7,\"\"))","v":""},""]
[null,{"$f":"IF(B172=\"\",\"\",IF(B172+7<=B$2,B172+7,\"\"))","v":""},""]
[null,{"$f":"IF(B173=\"\",\"\",IF(B173+7<=B$2,B173+7,\"\"))","v":""},""]
[null,{"$f":"IF(B174=\"\",\"\",IF(B174+7<=B$2,B174+7,\"\"))","v":""},""]
[null,{"$f":"IF(B175=\"\",\"\",IF(B175+7<=B$2,B175+7,\"\"))","v":""},""]
[null,{"$f":"IF(B176=\"\",\"\",IF(B176+7<=B$2,B176+7,\"\"))","v":""},""]
[null,{"$f":"IF(B177=\"\",\"\",IF(B177+7<=B$2,B177+7,\"\"))","v":""},""]
[null,{"$f":"IF(B178=\"\",\"\",IF(B178+7<=B$2,B178+7,\"\"))","v":""},""]
[null,{"$f":"IF(B179=\"\",\"\",IF(B179+7<=B$2,B179+7,\"\"))","v":""},""]
[null,{"$f":"IF(B180=\"\",\"\",IF(B180+7<=B$2,B180+7,\"\"))","v":""},""]
[null,{"$f":"IF(B181=\"\",\"\",IF(B181+7<=B$2,B181+7,\"\"))","v":""},""]
[null,{"$f":"IF(B182=\"\",\"\",IF(B182+7<=B$2,B182+7,\"\"))","v":""},""]
[null,{"$f":"IF(B183=\"\",\"\",IF(B183+7<=B$2,B183+7,\"\"))","v":""},""]
[null,{"$f":"IF(B184=\"\",\"\",IF(B184+7<=B$2,B184+7,\"\"))","v":""},""]
[null,{"$f":"IF(B185=\"\",\"\",IF(B185+7<=B$2,B185+7,\"\"))","v":""},""]
[null,{"$f":"IF(B186=\"\",\"\",IF(B186+7<=B$2,B186+7,\"\"))","v":""},""]
[null,{"$f":"IF(B187=\"\",\"\",IF(B187+7<=B$2,B187+7,\"\"))","v":""},""]
[null,{"$f":"IF(B188=\"\",\"\",IF(B188+7<=B$2,B188+7,\"\"))","v":""},""]
[null,{"$f":"IF(B189=\"\",\"\",IF(B189+7<=B$2,B189+7,\"\"))","v":""},""]
[null,{"$f":"IF(B190=\"\",\"\",IF(B190+7<=B$2,B190+7,\"\"))","v":""},""]
[null,{"$f":"IF(B191=\"\",\"\",IF(B191+7<=B$2,B191+7,\"\"))","v":""},""]
[null,{"$f":"IF(B192=\"\",\"\",IF(B192+7<=B$2,B192+7,\"\"))","v":""},""]
[null,{"$f":"IF(B193=\"\",\"\",IF(B193+7<=B$2,B193+7,\"\"))","v":""},""]
[null,{"$f":"IF(B194=\"\",\"\",IF(B194+7<=B$2,B194+7,\"\"))","v":""},""]
[null,{"$f":"IF(B195=\"\",\"\",IF(B195+7<=B$2,B195+7,\"\"))","v":""},""]
[null,{"$f":"IF(B196=\"\",\"\",IF(B196+7<=B$2,B196+7,\"\"))","v":""},""]
[null,{"$f":"IF(B197=\"\",\"\",IF(B197+7<=B$2,B197+7,\"\"))","v":""},""]
[null,{"$f":"IF(B198=\"\",\"\",IF(B198+7<=B$2,B198+7,\"\"))","v":""},""]
[null,{"$f":"IF(B199=\"\",\"\",IF(B199+7<=B$2,B199+7,\"\"))","v":""},""]
[null,{"$f":"IF(B200=\"\",\"\",IF(B200+7<=B$2,B200+7,\"\"))","v":""},""]
[null,{"$f":"IF(B201=\"\",\"\",IF(B201+7<=B$2,B201+7,\"\"))","v":""},""]
[null,{"$f":"IF(B202=\"\",\"\",IF(B202+7<=B$2,B202+7,\"\"))","v":""},""]
[null,{"$f":"IF(B203=\"\",\"\",IF(B203+7<=B$2,B203+7,\"\"))","v":""},""]
[null,{"$f":"IF(B204=\"\",\"\",IF(B204+7<=B$2,B204+7,\"\"))","v":""},""]
[null,{"$f":"IF(B205=\"\",\"\",IF(B205+7<=B$2,B205+7,\"\"))","v":""},""]
[null,{"$f":"IF(B206=\"\",\"\",IF(B206+7<=B$2,B206+7,\"\"))","v":""},""]
[null,{"$f":"IF(B207=\"\",\"\",IF(B207+7<=B$2,B207+7,\"\"))","v":""},""]
[null,{"$f":"IF(B208=\"\",\"\",IF(B208+7<=B$2,B208+7,\"\"))","v":""},""]
[null,{"$f":"IF(B209=\"\",\"\",IF(B209+7<=B$2,B209+7,\"\"))","v":""},""]
[null,{"$f":"IF(B210=\"\",\"\",IF(B210+7<=B$2,B210+7,\"\"))","v":""},""]
[null,{"$f":"IF(B211=\"\",\"\",IF(B211+7<=B$2,B211+7,\"\"))","v":""},""]
[null,{"$f":"IF(B212=\"\",\"\",IF(B212+7<=B$2,B212+7,\"\"))","v":""},""]
[null,{"$f":"IF(B213=\"\",\"\",IF(B213+7<=B$2,B213+7,\"\"))","v":""},""]
[null,{"$f":"IF(B214=\"\",\"\",IF(B214+7<=B$2,B214+7,\"\"))","v":""},""]
[null,{"$f":"IF(B215=\"\",\"\",IF(B215+7<=B$2,B215+7,\"\"))","v":""},""]
[null,{"$f":"IF(B216=\"\",\"\",IF(B216+7<=B$2,B216+7,\"\"))","v":""},""]
[null,{"$f":"IF(B217=\"\",\"\",IF(B217+7<=B$2,B217+7,\"\"))","v":""},""]
[null,{"$f":"IF(B218=\"\",\"\",IF(B218+7<=B$2,B218+7,\"\"))","v":""},""]
[null,{"$f":"IF(B219=\"\",\"\",IF(B219+7<=B$2,B219+7,\"\"))","v":""},""]
[null,{"$f":"IF(B220=\"\",\"\",IF(B220+7<=B$2,B220+7,\"\"))","v":""},""]
[null,{"$f":"IF(B221=\"\",\"\",IF(B221+7<=B$2,B221+7,\"\"))","v":""},""]
[null,{"$f":"IF(B222=\"\",\"\",IF(B222+7<=B$2,B222+7,\"\"))","v":""},""]
[null,{"$f":"IF(B223=\"\",\"\",IF(B223+7<=B$2,B223+7,\"\"))","v":""},""]
[null,{"$f":"IF(B224=\"\",\"\",IF(B224+7<=B$2,B224+7,\"\"))","v":""},""]
[null,{"$f":"IF(B225=\"\",\"\",IF(B225+7<=B$2,B225+7,\"\"))","v":""},""]
[null,{"$f":"IF(B226=\"\",\"\",IF(B226+7<=B$2,B226+7,\"\"))","v":""},""]
[null,{"$f":"IF(B227=\"\",\"\",IF(B227+7<=B$2,B227+7,\"\"))","v":""},""]
[null,{"$f":"IF(B228=\"\",\"\",IF(B228+7<=B$2,B228+7,\"\"))","v":""},""]
[null,{"$f":"IF(B229=\"\",\"\",IF(B229+7<=B$2,B229+7,\"\"))","v":""},""]
[null,{"$f":"IF(B230=\"\",\"\",IF(B230+7<=B$2,B230+7,\"\"))","v":""},""]
[null,{"$f":"IF(B231=\"\",\"\",IF(B231+7<=B$2,B231+7,\"\"))","v":""},""]
[null,{"$f":"IF(B232=\"\",\"\",IF(B232+7<=B$2,B232+7,\"\"))","v":""},""]
[null,{"$f":"IF(B233=\"\",\"\",IF(B233+7<=B$2,B233+7,\"\"))","v":""},""]
[null,{"$f":"IF(B234=\"\",\"\",IF(B234+7<=B$2,B234+7,\"\"))","v":""},""]
[null,{"$f":"IF(B235=\"\",\"\",IF(B235+7<=B$2,B235+7,\"\"))","v":""},""]
[null,{"$f":"IF(B236=\"\",\"\",IF(B236+7<=B$2,B236+7,\"\"))","v":""},""]
[null,{"$f":"IF(B237=\"\",\"\",IF(B237+7<=B$2,B237+7,\"\"))","v":""},""]
[null,{"$f":"IF(B238=\"\",\"\",IF(B238+7<=B$2,B238+7,\"\"))","v":""},""]
[null,{"$f":"IF(B239=\"\",\"\",IF(B239+7<=B$2,B239+7,\"\"))","v":""},""]
[null,{"$f":"IF(B240=\"\",\"\",IF(B240+7<=B$2,B240+7,\"\"))","v":""},""]
[null,{"$f":"IF(B241=\"\",\"\",IF(B241+7<=B$2,B241+7,\"\"))","v":""},""]
[null,{"$f":"IF(B242=\"\",\"\",IF(B242+7<=B$2,B242+7,\"\"))","v":""},""]
[null,{"$f":"IF(B243=\"\",\"\",IF(B243+7<=B$2,B243+7,\"\"))","v":""},""]
[null,{"$f":"IF(B244=\"\",\"\",IF(B244+7<=B$2,B244+7,\"\"))","v":""},""]
[null,{"$f":"IF(B245=\"\",\"\",IF(B245+7<=B$2,B245+7,\"\"))","v":""},""]
[null,{"$f":"IF(B246=\"\",\"\",IF(B246+7<=B$2,B246+7,\"\"))","v":""},""]
[null,{"$f":"IF(B247=\"\",\"\",IF(B247+7<=B$2,B247+7,\"\"))","v":""},""]
[null,{"$f":"IF(B248=\"\",\"\",IF(B248+7<=B$2,B248+7,\"\"))","v":""},""]
[null,{"$f":"IF(B249=\"\",\"\",IF(B249+7<=B$2,B249+7,\"\"))","v":""},""]
[null,{"$f":"IF(B250=\"\",\"\",IF(B250+7<=B$2,B250+7,\"\"))","v":""},""]
[null,{"$f":"IF(B251=\"\",\"\",IF(B251+7<=B$2,B251+7,\"\"))","v":""},""]
[null,{"$f":"IF(B252=\"\",\"\",IF(B252+7<=B$2,B252+7,\"\"))","v":""},""]
[null,{"$f":"IF(B253=\"\",\"\",IF(B253+7<=B$2,B253+7,\"\"))","v":""},""]
[null,{"$f":"IF(B254=\"\",\"\",IF(B254+7<=B$2,B254+7,\"\"))","v":""},""]
[null,{"$f":"IF(B255=\"\",\"\",IF(B255+7<=B$2,B255+7,\"\"))","v":""},""]
[null,{"$f":"IF(B256=\"\",\"\",IF(B256+7<=B$2,B256+7,\"\"))","v":""},""]
[null,{"$f":"IF(B257=\"\",\"\",IF(B257+7<=B$2,B257+7,\"\"))","v":""},""]
[null,{"$f":"IF(B258=\"\",\"\",IF(B258+7<=B$2,B258+7,\"\"))","v":""},""]
[null,{"$f":"IF(B259=\"\",\"\",IF(B259+7<=B$2,B259+7,\"\"))","v":""},""]
[null,{"$f":"IF(B260=\"\",\"\",IF(B260+7<=B$2,B260+7,\"\"))","v":""},""]
[null,{"$f":"IF(B261=\"\",\"\",IF(B261+7<=B$2,B261+7,\"\"))","v":""},""]
[null,{"$f":"IF(B262=\"\",\"\",IF(B262+7<=B$2,B262+7,\"\"))","v":""},""]
[null,{"$f":"IF(B263=\"\",\"\",IF(B263+7<=B$2,B263+7,\"\"))","v":""},""]
[null,{"$f":"IF(B264=\"\",\"\",IF(B264+7<=B$2,B264+7,\"\"))","v":""},""]
[null,{"$f":"IF(B265=\"\",\"\",IF(B265+7<=B$2,B265+7,\"\"))","v":""},""]
[null,{"$f":"IF(B266=\"\",\"\",IF(B266+7<=B$2,B266+7,\"\"))","v":""},""]
[null,{"$f":"IF(B267=\"\",\"\",IF(B267+7<=B$2,B267+7,\"\"))","v":""},""]
[null,{"$f":"IF(B268=\"\",\"\",IF(B268+7<=B$2,B268+7,\"\"))","v":""},""]
[null,{"$f":"IF(B269=\"\",\"\",IF(B269+7<=B$2,B269+7,\"\"))","v":""},""]
[null,{"$f":"IF(B270=\"\",\"\",IF(B270+7<=B$2,B270+7,\"\"))","v":""},""]
[null,{"$f":"IF(B271=\"\",\"\",IF(B271+7<=B$2,B271+7,\"\"))","v":""},""]
[null,{"$f":"IF(B272=\"\",\"\",IF(B272+7<=B$2,B272+7,\"\"))","v":""},""]
[null,{"$f":"IF(B273=\"\",\"\",IF(B273+7<=B$2,B273+7,\"\"))","v":""},""]
[null,{"$f":"IF(B274=\"\",\"\",IF(B274+7<=B$2,B274+7,\"\"))","v":""},""]
[null,{"$f":"IF(B275=\"\",\"\",IF(B275+7<=B$2,B275+7,\"\"))","v":""},""]
[null,{"$f":"IF(B276=\"\",\"\",IF(B276+7<=B$2,B276+7,\"\"))","v":""},""]
[null,{"$f":"IF(B277=\"\",\"\",IF(B277+7<=B$2,B277+7,\"\"))","v":""},""]
[null,{"$f":"IF(B278=\"\",\"\",IF(B278+7<=B$2,B278+7,\"\"))","v":""},""]
[null,{"$f":"IF(B279=\"\",\"\",IF(B279+7<=B$2,B279+7,\"\"))","v":""},""]
[null,{"$f":"IF(B280=\"\",\"\",IF(B280+7<=B$2,B280+7,\"\"))","v":""},""]
[null,{"$f":"IF(B281=\"\",\"\",IF(B281+7<=B$2,B281+7,\"\"))","v":""},""]
[null,{"$f":"IF(B282=\"\",\"\",IF(B282+7<=B$2,B282+7,\"\"))","v":""},""]
[null,{"$f":"IF(B283=\"\",\"\",IF(B283+7<=B$2,B283+7,\"\"))","v":""},""]
[null,{"$f":"IF(B284=\"\",\"\",IF(B284+7<=B$2,B284+7,\"\"))","v":""},""]
[null,{"$f":"IF(B285=\"\",\"\",IF(B285+7<=B$2,B285+7,\"\"))","v":""},""]
[null,{"$f":"IF(B286=\"\",\"\",IF(B286+7<=B$2,B286+7,\"\"))","v":""},""]
[null,{"$f":"IF(B287=\"\",\"\",IF(B287+7<=B$2,B287+7,\"\"))","v":""},""]
[null,{"$f":"IF(B288=\"\",\"\",IF(B288+7<=B$2,B288+7,\"\"))","v":""},""]
[null,{"$f":"IF(B289=\"\",\"\",IF(B289+7<=B$2,B289+7,\"\"))","v":""},""]
[null,{"$f":"IF(B290=\"\",\"\",IF(B290+7<=B$2,B290+7,\"\"))","v":""},""]
[null,{"$f":"IF(B291=\"\",\"\",IF(B291+7<=B$2,B291+7,\"\"))","v":""},""]
[null,{"$f":"IF(B292=\"\",\"\",IF(B292+7<=B$2,B292+7,\"\"))","v":""},""]
[null,{"$f":"IF(B293=\"\",\"\",IF(B293+7<=B$2,B293+7,\"\"))","v":""},""]
[null,{"$f":"IF(B294=\"\",\"\",IF(B294+7<=B$2,B294+7,\"\"))","v":""},""]
[null,{"$f":"IF(B295=\"\",\"\",IF(B295+7<=B$2,B295+7,\"\"))","v":""},""]
[null,{"$f":"IF(B296=\"\",\"\",IF(B296+7<=B$2,B296+7,\"\"))","v":""},""]
[null,{"$f":"IF(B297=\"\",\"\",IF(B297+7<=B$2,B297+7,\"\"))","v":""},""]
[null,{"$f":"IF(B298=\"\",\"\",IF(B298+7<=B$2,B298+7,\"\"))","v":""},""]
[null,{"$f":"IF(B299=\"\",\"\",IF(B299+7<=B$2,B299+7,\"\"))","v":""},""]
[null,{"$f":"IF(B300=\"\",\"\",IF(B300+7<=B$2,B300+7,\"\"))","v":""},""]
[null,{"$f":"IF(B301=\"\",\"\",IF(B301+7<=B$2,B301+7,\"\"))","v":""},""]
[null,{"$f":"IF(B302=\"\",\"\",IF(B302+7<=B$2,B302+7,\"\"))","v":""},""]

{"sheet":"eneF","index":23,"n_rows":20,"n_cols":12,"rows_kept":20,"cut":false,"hidden":true,"merged":[[9,0,9,1],[8,0,8,1],[0,9,1,9],[0,10,1,11],[3,9,4,11],[5,0,5,2],[6,0,6,2],[5,3,5,5],[6,3,6,5],[5,6,5,8],[6,6,6,8],[0,0,1,2],[2,0,2,2],[3,0,4,2],[17,0,17,1],[18,0,18,1],[19,0,19,1],[10,0,10,1],[11,0,11,1],[12,0,12,1],[15,0,15,1],[16,0,16,1],[13,0,13,1],[14,0,14,1]]}
["Cliente",null,null,null,null,null,null,null,null,"Mes",{"$f":"+Calendar!A8","v":"2019-01-01"}]
[]
[{"$f":"+Calendar!A5","v":"Rainbow Inc"}]
["Dirección",null,null,null,null,null,null,null,null,"Horario"]
[]
[{"$f":"+Calendar!AI2","v":"Toy street 1"},null,null,"Grupo / nivel",null,null,"Profesor",null,null,"Dias",{"$f":"+Calendar!AI12","v":"Martes"},{"$f":"+Calendar!AI14","v":"Jueves"}]
[{"$f":"+Calendar!AI3","v":"Barcelona"},null,null,{"$f":"+Calendar!Q5","v":"E1 - A1-1 Basico"},null,null,{"$f":"+Calendar!AI21","v":"Chris"},null,null,"Hora",{"$f":"+Calendar!AI17","v":"16:30:00"},{"$f":"+Calendar!AI18","v":"18:30:00"}]
[]
["Estudiante",null,{"$f":"+Calculations!H4","v":"2019-01-08"},{"$f":"+Calculations!I4","v":"2019-01-10"},{"$f":"+Calculations!J4","v":"2019-01-15"},{"$f":"+Calculations!K4","v":"2019-01-17"},{"$f":"+Calculations!L4","v":"2019-01-22"},{"$f":"+Calculations!M4","v":"2019-01-24"},{"$f":"+Calculations!N4","v":"2019-01-29"},{"$f":"+Calculations!O4","v":"2019-01-31"},{"$f":"+Calculations!P4","v":""},{"$f":"+Calculations!Q4","v":""}]
[]
[{"$f":"+Calendar!B42","v":"Rod"}]
[{"$f":"+Calendar!B43","v":"Jane"}]
[{"$f":"+Calendar!B44","v":"Freddy"}]
[{"$f":"+Calendar!B45","v":"George"}]
[{"$f":"+Calendar!B46","v":"Bungle"}]
[{"$f":"+Calendar!B47","v":"Zippy"}]
[{"$f":"+Calendar!B48","v":"Mathew"}]
[{"$f":"+Calendar!B49","v":"Sooty"}]
[{"$f":"+Calendar!B50","v":"Sweep"}]
[{"$f":"+Calendar!B51","v":"Sue"}]

{"sheet":"febF","index":24,"n_rows":20,"n_cols":12,"rows_kept":20,"cut":false,"hidden":true,"merged":[[0,10,1,11],[3,9,4,11],[5,3,5,5],[5,6,5,8],[6,0,6,2],[6,3,6,5],[6,6,6,8],[0,0,1,2],[2,0,2,2],[3,0,4,2],[5,0,5,2],[0,9,1,9],[8,0,8,1],[10,0,10,1],[18,0,18,1],[19,0,19,1],[9,0,9,1],[12,0,12,1],[13,0,13,1],[14,0,14,1],[15,0,15,1],[16,0,16,1],[17,0,17,1],[11,0,11,1]]}
["Cliente",null,null,null,null,null,null,null,null,"Mes",{"$f":"+Calendar!I8","v":"2019-02-01"}]
[]
[{"$f":"+Calendar!A5","v":"Rainbow Inc"}]
["Dirección",null,null,null,null,null,null,null,null,"Horario"]
[]
[{"$f":"+Calendar!AI2","v":"Toy street 1"},null,null,"Grupo / nivel",null,null,"Profesor",null,null,"Dias",{"$f":"+Calendar!AI12","v":"Martes"},{"$f":"+Calendar!AI14","v":"Jueves"}]
[{"$f":"+Calendar!AI3","v":"Barcelona"},null,null,{"$f":"+Calendar!Q5","v":"E1 - A1-1 Basico"},null,null,{"$f":"+Calendar!AI21","v":"Chris"},null,null,"Hora",{"$f":"+Calendar!AI17","v":"16:30:00"},{"$f":"+Calendar!AI18","v":"18:30:00"}]
[]
["Estudiante",null,{"$f":"+Calculations!H5","v":"2019-02-05"},{"$f":"+Calculations!I5","v":"2019-02-07"},{"$f":"+Calculations!J5","v":"2019-02-12"},{"$f":"+Calculations!K5","v":"2019-02-14"},{"$f":"+Calculations!L5","v":"2019-02-19"},{"$f":"+Calculations!M5","v":"2019-02-21"},{"$f":"+Calculations!N5","v":"2019-02-26"},{"$f":"+Calculations!O5","v":"2019-02-28"},{"$f":"+Calculations!P5","v":""},{"$f":"+Calculations!Q5","v":""}]
[]
[{"$f":"+Calendar!B42","v":"Rod"}]
[{"$f":"+Calendar!B43","v":"Jane"}]
[{"$f":"+Calendar!B44","v":"Freddy"}]
[{"$f":"+Calendar!B45","v":"George"}]
[{"$f":"+Calendar!B46","v":"Bungle"}]
[{"$f":"+Calendar!B47","v":"Zippy"}]
[{"$f":"+Calendar!B48","v":"Mathew"}]
[{"$f":"+Calendar!B49","v":"Sooty"}]
[{"$f":"+Calendar!B50","v":"Sweep"}]
[{"$f":"+Calendar!B51","v":"Sue"}]

{"sheet":"marF","index":25,"n_rows":20,"n_cols":12,"rows_kept":20,"cut":false,"hidden":true,"merged":[[0,10,1,11],[3,9,4,11],[5,3,5,5],[5,6,5,8],[6,0,6,2],[6,3,6,5],[6,6,6,8],[0,0,1,2],[2,0,2,2],[3,0,4,2],[5,0,5,2],[0,9,1,9],[8,0,8,1],[10,0,10,1],[18,0,18,1],[19,0,19,1],[9,0,9,1],[12,0,12,1],[13,0,13,1],[14,0,14,1],[15,0,15,1],[16,0,16,1],[17,0,17,1],[11,0,11,1]]}
["Cliente",null,null,null,null,null,null,null,null,"Mes",{"$f":"+Calendar!Q8","v":"2019-03-01"}]
[]
[{"$f":"+Calendar!A5","v":"Rainbow Inc"}]
["Dirección",null,null,null,null,null,null,null,null,"Horario"]
[]
[{"$f":"+Calendar!AI2","v":"Toy street 1"},null,null,"Grupo / nivel",null,null,"Profesor",null,null,"Dias",{"$f":"+Calendar!AI12","v":"Martes"},{"$f":"+Calendar!AI14","v":"Jueves"}]
[{"$f":"+Calendar!AI3","v":"Barcelona"},null,null,{"$f":"+Calendar!Q5","v":"E1 - A1-1 Basico"},null,null,{"$f":"+Calendar!AI21","v":"Chris"},null,null,"Hora",{"$f":"+Calendar!AI17","v":"16:30:00"},{"$f":"+Calendar!AI18","v":"18:30:00"}]
[]
["Estudiante",null,{"$f":"+Calculations!H6","v":"2019-03-05"},{"$f":"+Calculations!I6","v":"2019-03-07"},{"$f":"+Calculations!J6","v":"2019-03-12"},{"$f":"+Calculations!K6","v":"2019-03-14"},{"$f":"+Calculations!L6","v":"2019-03-19"},{"$f":"+Calculations!M6","v":"2019-03-21"},{"$f":"+Calculations!N6","v":"2019-03-26"},{"$f":"+Calculations!O6","v":"2019-03-28"},{"$f":"+Calculations!P6","v":""},{"$f":"+Calculations!Q6","v":""}]
[]
[{"$f":"+Calendar!B42","v":"Rod"}]
[{"$f":"+Calendar!B43","v":"Jane"}]
[{"$f":"+Calendar!B44","v":"Freddy"}]
[{"$f":"+Calendar!B45","v":"George"}]
[{"$f":"+Calendar!B46","v":"Bungle"}]
[{"$f":"+Calendar!B47","v":"Zippy"}]
[{"$f":"+Calendar!B48","v":"Mathew"}]
[{"$f":"+Calendar!B49","v":"Sooty"}]
[{"$f":"+Calendar!B50","v":"Sweep"}]
[{"$f":"+Calendar!B51","v":"Sue"}]

{"sheet":"abrF","index":26,"n_rows":20,"n_cols":12,"rows_kept":20,"cut":false,"hidden":true,"merged":[[0,10,1,11],[3,9,4,11],[5,3,5,5],[5,6,5,8],[6,0,6,2],[6,3,6,5],[6,6,6,8],[0,0,1,2],[2,0,2,2],[3,0,4,2],[5,0,5,2],[0,9,1,9],[8,0,8,1],[10,0,10,1],[18,0,18,1],[19,0,19,1],[9,0,9,1],[12,0,12,1],[13,0,13,1],[14,0,14,1],[15,0,15,1],[16,0,16,1],[17,0,17,1],[11,0,11,1]]}
["Cliente",null,null,null,null,null,null,null,null,"Mes",{"$f":"+Calendar!Y8","v":"2019-04-01"}]
[]
[{"$f":"+Calendar!A5","v":"Rainbow Inc"}]
["Dirección",null,null,null,null,null,null,null,null,"Horario"]
[]
[{"$f":"+Calendar!AI2","v":"Toy street 1"},null,null,"Grupo / nivel",null,null,"Profesor",null,null,"Dias",{"$f":"+Calendar!AI12","v":"Martes"},{"$f":"+Calendar!AI14","v":"Jueves"}]
[{"$f":"+Calendar!AI3","v":"Barcelona"},null,null,{"$f":"+Calendar!Q5","v":"E1 - A1-1 Basico"},null,null,{"$f":"+Calendar!AI21","v":"Chris"},null,null,"Hora",{"$f":"+Calendar!AI17","v":"16:30:00"},{"$f":"+Calendar!AI18","v":"18:30:00"}]
[]
["Estudiante",null,{"$f":"+Calculations!H7","v":"2019-04-02"},{"$f":"+Calculations!I7","v":"2019-04-04"},{"$f":"+Calculations!J7","v":"2019-04-09"},{"$f":"+Calculations!K7","v":"2019-04-11"},{"$f":"+Calculations!L7","v":"2019-04-16"},{"$f":"+Calculations!M7","v":"2019-04-18"},{"$f":"+Calculations!N7","v":"2019-04-23"},{"$f":"+Calculations!O7","v":"2019-04-25"},{"$f":"+Calculations!P7","v":"2019-04-30"},{"$f":"+Calculations!Q7","v":""}]
[]
[{"$f":"+Calendar!B42","v":"Rod"}]
[{"$f":"+Calendar!B43","v":"Jane"}]
[{"$f":"+Calendar!B44","v":"Freddy"}]
[{"$f":"+Calendar!B45","v":"George"}]
[{"$f":"+Calendar!B46","v":"Bungle"}]
[{"$f":"+Calendar!B47","v":"Zippy"}]
[{"$f":"+Calendar!B48","v":"Mathew"}]
[{"$f":"+Calendar!B49","v":"Sooty"}]
[{"$f":"+Calendar!B50","v":"Sweep"}]
[{"$f":"+Calendar!B51","v":"Sue"}]

{"sheet":"mayF","index":27,"n_rows":20,"n_cols":12,"rows_kept":20,"cut":false,"hidden":true,"merged":[[0,10,1,11],[3,9,4,11],[5,3,5,5],[5,6,5,8],[6,0,6,2],[6,3,6,5],[6,6,6,8],[0,0,1,2],[2,0,2,2],[3,0,4,2],[5,0,5,2],[0,9,1,9],[8,0,8,1],[10,0,10,1],[18,0,18,1],[19,0,19,1],[9,0,9,1],[12,0,12,1],[13,0,13,1],[14,0,14,1],[15,0,15,1],[16,0,16,1],[17,0,17,1],[11,0,11,1]]}
["Cliente",null,null,null,null,null,null,null,null,"Mes",{"$f":"+Calendar!A17","v":"2019-05-01"}]
[]
[{"$f":"+Calendar!A5","v":"Rainbow Inc"}]
["Dirección",null,null,null,null,null,null,null,null,"Horario"]
[]
[{"$f":"+Calendar!AI2","v":"Toy street 1"},null,null,"Grupo / nivel",null,null,"Profesor",null,null,"Dias",{"$f":"+Calendar!AI12","v":"Martes"},{"$f":"+Calendar!AI14","v":"Jueves"}]
[{"$f":"+Calendar!AI3","v":"Barcelona"},null,null,{"$f":"+Calendar!Q5","v":"E1 - A1-1 Basico"},null,null,{"$f":"+Calendar!AI21","v":"Chris"},null,null,"Hora",{"$f":"+Calendar!AI17","v":"16:30:00"},{"$f":"+Calendar!AI18","v":"18:30:00"}]
[]
["Estudiante",null,{"$f":"+Calculations!H8","v":"2019-05-02"},{"$f":"+Calculations!I8","v":"2019-05-07"},{"$f":"+Calculations!J8","v":"2019-05-09"},{"$f":"+Calculations!K8","v":"2019-05-14"},{"$f":"+Calculations!L8","v":"2019-05-16"},{"$f":"+Calculations!M8","v":"2019-05-21"},{"$f":"+Calculations!N8","v":"2019-05-23"},{"$f":"+Calculations!O8","v":"2019-05-28"},{"$f":"+Calculations!P8","v":"2019-05-30"},{"$f":"+Calculations!Q8","v":""}]
[]
[{"$f":"+Calendar!B42","v":"Rod"}]
[{"$f":"+Calendar!B43","v":"Jane"}]
[{"$f":"+Calendar!B44","v":"Freddy"}]
[{"$f":"+Calendar!B45","v":"George"}]
[{"$f":"+Calendar!B46","v":"Bungle"}]
[{"$f":"+Calendar!B47","v":"Zippy"}]
[{"$f":"+Calendar!B48","v":"Mathew"}]
[{"$f":"+Calendar!B49","v":"Sooty"}]
[{"$f":"+Calendar!B50","v":"Sweep"}]
[{"$f":"+Calendar!B51","v":"Sue"}]

{"sheet":"junF","index":28,"n_rows":20,"n_cols":12,"rows_kept":20,"cut":false,"hidden":true,"merged":[[0,10,1,11],[3,9,4,11],[5,3,5,5],[5,6,5,8],[6,0,6,2],[6,3,6,5],[6,6,6,8],[0,0,1,2],[2,0,2,2],[3,0,4,2],[5,0,5,2],[0,9,1,9],[8,0,8,1],[10,0,10,1],[18,0,18,1],[19,0,19,1],[9,0,9,1],[12,0,12,1],[13,0,13,1],[14,0,14,1],[15,0,15,1],[16,0,16,1],[17,0,17,1],[11,0,11,1]]}
["Cliente",null,null,null,null,null,null,null,null,"Mes",{"$f":"+Calendar!I17","v":"2019-06-01"}]
[]
[{"$f":"+Calendar!A5","v":"Rainbow Inc"}]
["Dirección",null,null,null,null,null,null,null,null,"Horario"]
[]
[{"$f":"+Calendar!AI2","v":"Toy street 1"},null,null,"Grupo / nivel",null,null,"Profesor",null,null,"Dias",{"$f":"+Calendar!AI12","v":"Martes"},{"$f":"+Calendar!AI14","v":"Jueves"}]
[{"$f":"+Calendar!AI3","v":"Barcelona"},null,null,{"$f":"+Calendar!Q5","v":"E1 - A1-1 Basico"},null,null,{"$f":"+Calendar!AI21","v":"Chris"},null,null,"Hora",{"$f":"+Calendar!AI17","v":"16:30:00"},{"$f":"+Calendar!AI18","v":"18:30:00"}]
[]
["Estudiante",null,{"$f":"+Calculations!H9","v":"2019-06-04"},{"$f":"+Calculations!I9","v":"2019-06-06"},{"$f":"+Calculations!J9","v":"2019-06-11"},{"$f":"+Calculations!K9","v":"2019-06-13"},{"$f":"+Calculations!L9","v":"2019-06-18"},{"$f":"+Calculations!M9","v":"2019-06-20"},{"$f":"+Calculations!N9","v":"2019-06-25"},{"$f":"+Calculations!O9","v":"2019-06-27"},{"$f":"+Calculations!P9","v":""},{"$f":"+Calculations!Q9","v":""}]
[]
[{"$f":"+Calendar!B42","v":"Rod"}]
[{"$f":"+Calendar!B43","v":"Jane"}]
[{"$f":"+Calendar!B44","v":"Freddy"}]
[{"$f":"+Calendar!B45","v":"George"}]
[{"$f":"+Calendar!B46","v":"Bungle"}]
[{"$f":"+Calendar!B47","v":"Zippy"}]
[{"$f":"+Calendar!B48","v":"Mathew"}]
[{"$f":"+Calendar!B49","v":"Sooty"}]
[{"$f":"+Calendar!B50","v":"Sweep"}]
[{"$f":"+Calendar!B51","v":"Sue"}]

{"sheet":"julF","index":29,"n_rows":20,"n_cols":12,"rows_kept":20,"cut":false,"hidden":true,"merged":[[0,10,1,11],[3,9,4,11],[5,3,5,5],[5,6,5,8],[6,0,6,2],[6,3,6,5],[6,6,6,8],[0,0,1,2],[2,0,2,2],[3,0,4,2],[5,0,5,2],[0,9,1,9],[8,0,8,1],[10,0,10,1],[18,0,18,1],[19,0,19,1],[9,0,9,1],[12,0,12,1],[13,0,13,1],[14,0,14,1],[15,0,15,1],[16,0,16,1],[17,0,17,1],[11,0,11,1]]}
["Cliente",null,null,null,null,null,null,null,null,"Mes",{"$f":"+Calendar!Q17","v":"2019-07-01"}]
[]
[{"$f":"+Calendar!A5","v":"Rainbow Inc"}]
["Dirección",null,null,null,null,null,null,null,null,"Horario"]
[]
[{"$f":"+Calendar!AI2","v":"Toy street 1"},null,null,"Grupo / nivel",null,null,"Profesor",null,null,"Dias",{"$f":"+Calendar!AI12","v":"Martes"},{"$f":"+Calendar!AI14","v":"Jueves"}]
[{"$f":"+Calendar!AI3","v":"Barcelona"},null,null,{"$f":"+Calendar!Q5","v":"E1 - A1-1 Basico"},null,null,{"$f":"+Calendar!AI21","v":"Chris"},null,null,"Hora",{"$f":"+Calendar!AI17","v":"16:30:00"},{"$f":"+Calendar!AI18","v":"18:30:00"}]
[]
["Estudiante",null,{"$f":"+Calculations!H10","v":"2019-07-02"},{"$f":"+Calculations!I10","v":"2019-07-04"},{"$f":"+Calculations!J10","v":"2019-07-09"},{"$f":"+Calculations!K10","v":"2019-07-11"},{"$f":"+Calculations!L10","v":"2019-07-16"},{"$f":"+Calculations!M10","v":"2019-07-18"},{"$f":"+Calculations!N10","v":"2019-07-23"},{"$f":"+Calculations!O10","v":"2019-07-25"},{"$f":"+Calculations!P10","v":"2019-07-30"},{"$f":"+Calculations!Q10","v":""}]
[]
[{"$f":"+Calendar!B42","v":"Rod"}]
[{"$f":"+Calendar!B43","v":"Jane"}]
[{"$f":"+Calendar!B44","v":"Freddy"}]
[{"$f":"+Calendar!B45","v":"George"}]
[{"$f":"+Calendar!B46","v":"Bungle"}]
[{"$f":"+Calendar!B47","v":"Zippy"}]
[{"$f":"+Calendar!B48","v":"Mathew"}]
[{"$f":"+Calendar!B49","v":"Sooty"}]
[{"$f":"+Calendar!B50","v":"Sweep"}]
[{"$f":"+Calendar!B51","v":"Sue"}]

{"sheet":"sepF","index":30,"n_rows":20,"n_cols":12,"rows_kept":20,"cut":false,"hidden":true,"merged":[[0,10,1,11],[3,9,4,11],[5,3,5,5],[5,6,5,8],[6,0,6,2],[6,3,6,5],[6,6,6,8],[0,0,1,2],[2,0,2,2],[3,0,4,2],[5,0,5,2],[0,9,1,9],[8,0,8,1],[10,0,10,1],[18,0,18,1],[19,0,19,1],[9,0,9,1],[12,0,12,1],[13,0,13,1],[14,0,14,1],[15,0,15,1],[16,0,16,1],[17,0,17,1],[11,0,11,1]]}
["Cliente",null,null,null,null,null,null,null,null,"Mes",{"$f":"+Calendar!A26","v":"2019-09-01"}]
[]
[{"$f":"+Calendar!A5","v":"Rainbow Inc"}]
["Dirección",null,null,null,null,null,null,null,null,"Horario"]
[]
[{"$f":"+Calendar!AI2","v":"Toy street 1"},null,null,"Grupo / nivel",null,null,"Profesor",null,null,"Dias",{"$f":"+Calendar!AI12","v":"Martes"},{"$f":"+Calendar!AI14","v":"Jueves"}]
[{"$f":"+Calendar!AI3","v":"Barcelona"},null,null,{"$f":"+Calendar!Q5","v":"E1 - A1-1 Basico"},null,null,{"$f":"+Calendar!AI21","v":"Chris"},null,null,"Hora",{"$f":"+Calendar!AI17","v":"16:30:00"},{"$f":"+Calendar!AI18","v":"18:30:00"}]
[]
["Estudiante",null,{"$f":"+Calculations!H12","v":"2019-09-03"},{"$f":"+Calculations!I12","v":"2019-09-05"},{"$f":"+Calculations!J12","v":"2019-09-10"},{"$f":"+Calculations!K12","v":"2019-09-12"},{"$f":"+Calculations!L12","v":"2019-09-17"},{"$f":"+Calculations!M12","v":"2019-09-19"},{"$f":"+Calculations!N12","v":"2019-09-24"},{"$f":"+Calculations!O12","v":"2019-09-26"},{"$f":"+Calculations!P12","v":""},{"$f":"+Calculations!Q12","v":""}]
[]
[{"$f":"+Calendar!B42","v":"Rod"}]
[{"$f":"+Calendar!B43","v":"Jane"}]
[{"$f":"+Calendar!B44","v":"Freddy"}]
[{"$f":"+Calendar!B45","v":"George"}]
[{"$f":"+Calendar!B46","v":"Bungle"}]
[{"$f":"+Calendar!B47","v":"Zippy"}]
[{"$f":"+Calendar!B48","v":"Mathew"}]
[{"$f":"+Calendar!B49","v":"Sooty"}]
[{"$f":"+Calendar!B50","v":"Sweep"}]
[{"$f":"+Calendar!B51","v":"Sue"}]

{"sheet":"octF","index":31,"n_rows":20,"n_cols":12,"rows_kept":20,"cut":false,"hidden":true,"merged":[[0,0,1,2],[0,9,1,9],[0,10,1,11],[2,0,2,2],[3,0,4,2],[3,9,4,11],[5,0,5,2],[5,3,5,5],[5,6,5,8],[6,0,6,2],[6,3,6,5],[6,6,6,8],[19,0,19,1],[8,0,8,1],[9,0,9,1],[10,0,10,1],[11,0,11,1],[12,0,12,1],[13,0,13,1],[14,0,14,1],[15,0,15,1],[16,0,16,1],[17,0,17,1],[18,0,18,1]]}
["Cliente",null,null,null,null,null,null,null,null,"Mes",{"$f":"+Calendar!I26","v":"2019-10-01"}]
[]
[{"$f":"+Calendar!A5","v":"Rainbow Inc"}]
["Dirección",null,null,null,null,null,null,null,null,"Horario"]
[]
[{"$f":"+Calendar!AI2","v":"Toy street 1"},null,null,"Grupo / nivel",null,null,"Profesor",null,null,"Dias",{"$f":"+Calendar!AI12","v":"Martes"},{"$f":"+Calendar!AI14","v":"Jueves"}]
[{"$f":"+Calendar!AI3","v":"Barcelona"},null,null,{"$f":"+Calendar!Q5","v":"E1 - A1-1 Basico"},null,null,{"$f":"+Calendar!AI21","v":"Chris"},null,null,"Hora",{"$f":"+Calendar!AI17","v":"16:30:00"},{"$f":"+Calendar!AI18","v":"18:30:00"}]
[]
["Estudiante",null,{"$f":"+Calculations!H13","v":"2019-10-01"},{"$f":"+Calculations!I13","v":"2019-10-03"},{"$f":"+Calculations!J13","v":"2019-10-08"},{"$f":"+Calculations!K13","v":"2019-10-10"},{"$f":"+Calculations!L13","v":"2019-10-15"},{"$f":"+Calculations!M13","v":"2019-10-17"},{"$f":"+Calculations!N13","v":"2019-10-22"},{"$f":"+Calculations!O13","v":"2019-10-24"},{"$f":"+Calculations!P13","v":"2019-10-29"},{"$f":"+Calculations!Q13","v":"2019-10-31"}]
[]
[{"$f":"+Calendar!B42","v":"Rod"}]
[{"$f":"+Calendar!B43","v":"Jane"}]
[{"$f":"+Calendar!B44","v":"Freddy"}]
[{"$f":"+Calendar!B45","v":"George"}]
[{"$f":"+Calendar!B46","v":"Bungle"}]
[{"$f":"+Calendar!B47","v":"Zippy"}]
[{"$f":"+Calendar!B48","v":"Mathew"}]
[{"$f":"+Calendar!B49","v":"Sooty"}]
[{"$f":"+Calendar!B50","v":"Sweep"}]
[{"$f":"+Calendar!B51","v":"Sue"}]

{"sheet":"novF","index":32,"n_rows":20,"n_cols":12,"rows_kept":20,"cut":false,"hidden":true,"merged":[[0,0,1,2],[0,9,1,9],[0,10,1,11],[2,0,2,2],[3,0,4,2],[3,9,4,11],[5,0,5,2],[5,3,5,5],[5,6,5,8],[6,0,6,2],[6,3,6,5],[6,6,6,8],[19,0,19,1],[8,0,8,1],[9,0,9,1],[10,0,10,1],[11,0,11,1],[12,0,12,1],[13,0,13,1],[14,0,14,1],[15,0,15,1],[16,0,16,1],[17,0,17,1],[18,0,18,1]]}
["Cliente",null,null,null,null,null,null,null,null,"Mes",{"$f":"+Calendar!Q26","v":"2019-11-01"}]
[]
[{"$f":"+Calendar!A5","v":"Rainbow Inc"}]
["Dirección",null,null,null,null,null,null,null,null,"Horario"]
[]
[{"$f":"+Calendar!AI2","v":"Toy street 1"},null,null,"Grupo / nivel",null,null,"Profesor",null,null,"Dias",{"$f":"+Calendar!AI12","v":"Martes"},{"$f":"+Calendar!AI14","v":"Jueves"}]
[{"$f":"+Calendar!AI3","v":"Barcelona"},null,null,{"$f":"+Calendar!Q5","v":"E1 - A1-1 Basico"},null,null,{"$f":"+Calendar!AI21","v":"Chris"},null,null,"Hora",{"$f":"+Calendar!AI17","v":"16:30:00"},{"$f":"+Calendar!AI18","v":"18:30:00"}]
[]
["Estudiante",null,{"$f":"+Calculations!H14","v":"2019-11-05"},{"$f":"+Calculations!I14","v":"2019-11-07"},{"$f":"+Calculations!J14","v":"2019-11-12"},{"$f":"+Calculations!K14","v":"2019-11-14"},{"$f":"+Calculations!L14","v":"2019-11-19"},{"$f":"+Calculations!M14","v":"2019-11-21"},{"$f":"+Calculations!N14","v":"2019-11-26"},{"$f":"+Calculations!O14","v":"2019-11-28"},{"$f":"+Calculations!P14","v":""},{"$f":"+Calculations!Q14","v":""}]
[]
[{"$f":"+Calendar!B42","v":"Rod"}]
[{"$f":"+Calendar!B43","v":"Jane"}]
[{"$f":"+Calendar!B44","v":"Freddy"}]
[{"$f":"+Calendar!B45","v":"George"}]
[{"$f":"+Calendar!B46","v":"Bungle"}]
[{"$f":"+Calendar!B47","v":"Zippy"}]
[{"$f":"+Calendar!B48","v":"Mathew"}]
[{"$f":"+Calendar!B49","v":"Sooty"}]
[{"$f":"+Calendar!B50","v":"Sweep"}]
[{"$f":"+Calendar!B51","v":"Sue"}]

{"sheet":"dicF","index":33,"n_rows":20,"n_cols":12,"rows_kept":20,"cut":false,"hidden":true,"merged":[[0,0,1,2],[0,9,1,9],[0,10,1,11],[2,0,2,2],[3,0,4,2],[3,9,4,11],[5,0,5,2],[5,3,5,5],[5,6,5,8],[6,0,6,2],[6,3,6,5],[6,6,6,8],[19,0,19,1],[8,0,8,1],[9,0,9,1],[10,0,10,1],[11,0,11,1],[12,0,12,1],[13,0,13,1],[14,0,14,1],[15,0,15,1],[16,0,16,1],[17,0,17,1],[18,0,18,1]]}
["Cliente",null,null,null,null,null,null,null,null,"Mes",{"$f":"+Calendar!Y26","v":"2019-12-01"}]
[]
[{"$f":"+Calendar!A5","v":"Rainbow Inc"}]
["Dirección",null,null,null,null,null,null,null,null,"Horario"]
[]
[{"$f":"+Calendar!AI2","v":"Toy street 1"},null,null,"Grupo / nivel",null,null,"Profesor",null,null,"Dias",{"$f":"+Calendar!AI12","v":"Martes"},{"$f":"+Calendar!AI14","v":"Jueves"}]
[{"$f":"+Calendar!AI3","v":"Barcelona"},null,null,{"$f":"+Calendar!Q5","v":"E1 - A1-1 Basico"},null,null,{"$f":"+Calendar!AI21","v":"Chris"},null,null,"Hora",{"$f":"+Calendar!AI17","v":"16:30:00"},{"$f":"+Calendar!AI18","v":"18:30:00"}]
[]
["Estudiante",null,{"$f":"+Calculations!H15","v":"2019-12-03"},{"$f":"+Calculations!I15","v":"2019-12-05"},{"$f":"+Calculations!J15","v":"2019-12-10"},{"$f":"+Calculations!K15","v":"2019-12-12"},{"$f":"+Calculations!L15","v":"2019-12-17"},{"$f":"+Calculations!M15","v":"2019-12-19"},{"$f":"+Calculations!N15","v":""},{"$f":"+Calculations!O15","v":""},{"$f":"+Calculations!P15","v":""},{"$f":"+Calculations!Q15","v":""}]
[]
[{"$f":"+Calendar!B42","v":"Rod"}]
[{"$f":"+Calendar!B43","v":"Jane"}]
[{"$f":"+Calendar!B44","v":"Freddy"}]
[{"$f":"+Calendar!B45","v":"George"}]
[{"$f":"+Calendar!B46","v":"Bungle"}]
[{"$f":"+Calendar!B47","v":"Zippy"}]
[{"$f":"+Calendar!B48","v":"Mathew"}]
[{"$f":"+Calendar!B49","v":"Sooty"}]
[{"$f":"+Calendar!B50","v":"Sweep"}]
[{"$f":"+Calendar!B51","v":"Sue"}]

{"sheet":"Calendar","index":34,"n_rows":112,"n_cols":40,"rows_kept":112,"cut":false,"hidden":true,"merged":[[25,8,25,14],[25,16,25,22],[25,24,25,30],[7,24,7,30],[16,0,16,6],[16,8,16,14],[16,16,16,22],[16,24,16,30],[25,0,25,6],[4,0,4,14],[4,16,4,30],[2,16,3,30],[2,0,3,14],[7,0,7,6],[7,8,7,14],[7,16,7,22],[35,0,36,9],[37,0,38,9],[38,24,38,30],[35,12,36,26],[35,27,36,30],[38,13,38,16],[38,17,38,21],[39,0,40,9],[40,12,40,15],[40,17,40,19],[40,23,40,25],[40,28,40,30],[41,1,41,9],[42,1,42,9],[42,12,42,15],[42,17,42,19],[42,23,42,25],[42,28,42,30],[43,1,43,9],[44,1,44,9],[44,23,44,25],[44,28,44,29],[45,1,45,9],[46,1,46,9],[46,12,46,14],[46,17,46,19],[46,23,46,25],[46,28,46,30],[47,1,47,9],[48,1,48,9],[52,13,52,15],[52,17,52,19],[52,27,52,30],[49,1,49,9],[50,1,50,9]]}
[null,null,null,null,null,null,null,null,null,null,null,null,null,null,null,null,null,null,null,null,null,null,null,null,null,null,null,null,null,null,null,null,null,"Client",{"$f":"+'Home Page'!C6","v":"Rainbow Inc"}]
[null,null,null,null,null,null,null,null,null,null,null,null,null,null,null,null,null,null,null,null,null,null,null,null,null,null,null,null,null,null,null,null,null,"Direccion",{"$f":"+'Home Page'!C7","v":"Toy street 1"}]
["Cliente",null,null,null,null,null,null,null,null,null,null,null,null,null,null,null,"Curso",null,null,null,null,null,null,null,null,null,null,null,null,null,null,null,null,null,{"$f":"+'Home Page'!C8","v":"Barcelona"},null,"Year",2019]
[null,null,null,null,null,null,null,null,null,null,null,null,null,null,null,null,null,null,null,null,null,null,null,null,null,null,null,null,null,null,null,null,null,"Tarif",null,null,"Month",1]
[{"$f":"+AI1","v":"Rainbow Inc"},null,null,null,null,null,null,null,null,null,null,null,null,null,null,null,{"$f":"+AI5","v":"E1 - A1-1 Basico"},null,null,null,null,null,null,null,null,null,null,null,null,null,null,null,null,"Course",{"$f":"+'Home Page'!C10","v":"E1 - A1-1 Basico"},null,"Start day",1]
[]
[null,null,null,null,null,null,null,null,null,null,null,null,null,null,null,null,null,null,null,null,null,null,null,null,null,null,null,null,null,null,null,null,null,"Course",null,null,null,{"$f":"+IF(AI14>1,(AI8+2),\"\")","v":"2019-01-10"},"Weekend","Holidays"]
[{"$f":"DATE($AL$3,$AL$4,1)","v":"2019-01-01"},null,null,null,null,null,null,null,{"$f":"DATE(YEAR(A8+35),MONTH(A8+35),1)","v":"2019-02-01"},null,null,null,null,null,null,null,{"$f":"DATE(YEAR(I8+35),MONTH(I8+35),1)","v":"2019-03-01"},null,null,null,null,null,null,null,{"$f":"DATE(YEAR(Q8+35),MONTH(Q8+35),1)","v":"2019-04-01"},null,null,null,null,null,null,null,null,"Start",{"$f":"+'Home Page'!C13","v":"2019-01-08"},null,null,{"$f":"+IF(AI14>1,AI9,\"\")","v":"2019-12-19"}]
[{"$f":"CHOOSE(1+MOD($AL$5+1-2,7),\"D\",\"L\",\"M\",\"X\",\"J\",\"V\",\"S\")","v":"D"},{"$f":"CHOOSE(1+MOD($AL$5+2-2,7),\"D\",\"L\",\"M\",\"X\",\"J\",\"V\",\"S\")","v":"L"},{"$f":"CHOOSE(1+MOD($AL$5+3-2,7),\"D\",\"L\",\"M\",\"X\",\"J\",\"V\",\"S\")","v":"M"},{"$f":"CHOOSE(1+MOD($AL$5+4-2,7),\"D\",\"L\",\"M\",\"X\",\"J\",\"V\",\"S\")","v":"X"},{"$f":"CHOOSE(1+MOD($AL$5+5-2,7),\"D\",\"L\",\"M\",\"X\",\"J\",\"V\",\"S\")","v":"J"},{"$f":"CHOOSE(1+MOD($AL$5+6-2,7),\"D\",\"L\",\"M\",\"X\",\"J\",\"V\",\"S\")","v":"V"},{"$f":"CHOOSE(1+MOD($AL$5+7-2,7),\"D\",\"L\",\"M\",\"X\",\"J\",\"V\",\"S\")","v":"S"},null,{"$f":"CHOOSE(1+MOD($AL$5+1-2,7),\"D\",\"L\",\"M\",\"X\",\"J\",\"V\",\"S\")","v":"D"},{"$f":"CHOOSE(1+MOD($AL$5+2-2,7),\"D\",\"L\",\"M\",\"X\",\"J\",\"V\",\"S\")","v":"L"},{"$f":"CHOOSE(1+MOD($AL$5+3-2,7),\"D\",\"L\",\"M\",\"X\",\"J\",\"V\",\"S\")","v":"M"},{"$f":"CHOOSE(1+MOD($AL$5+4-2,7),\"D\",\"L\",\"M\",\"X\",\"J\",\"V\",\"S\")","v":"X"},{"$f":"CHOOSE(1+MOD($AL$5+5-2,7),\"D\",\"L\",\"M\",\"X\",\"J\",\"V\",\"S\")","v":"J"},{"$f":"CHOOSE(1+MOD($AL$5+6-2,7),\"D\",\"L\",\"M\",\"X\",\"J\",\"V\",\"S\")","v":"V"},{"$f":"CHOOSE(1+MOD($AL$5+7-2,7),\"D\",\"L\",\"M\",\"X\",\"J\",\"V\",\"S\")","v":"S"},null,{"$f":"CHOOSE(1+MOD($AL$5+1-2,7),\"D\",\"L\",\"M\",\"X\",\"J\",\"V\",\"S\")","v":"D"},{"$f":"CHOOSE(1+MOD($AL$5+2-2,7),\"D\",\"L\",\"M\",\"X\",\"J\",\"V\",\"S\")","v":"L"},{"$f":"CHOOSE(1+MOD($AL$5+3-2,7),\"D\",\"L\",\"M\",\"X\",\"J\",\"V\",\"S\")","v":"M"},{"$f":"CHOOSE(1+MOD($AL$5+4-2,7),\"D\",\"L\",\"M\",\"X\",\"J\",\"V\",\"S\")","v":"X"},{"$f":"CHOOSE(1+MOD($AL$5+5-2,7),\"D\",\"L\",\"M\",\"X\",\"J\",\"V\",\"S\")","v":"J"},{"$f":"CHOOSE(1+MOD($AL$5+6-2,7),\"D\",\"L\",\"M\",\"X\",\"J\",\"V\",\"S\")","v":"V"},{"$f":"CHOOSE(1+MOD($AL$5+7-2,7),\"D\",\"L\",\"M\",\"X\",\"J\",\"V\",\"S\")","v":"S"},null,{"$f":"CHOOSE(1+MOD($AL$5+1-2,7),\"D\",\"L\",\"M\",\"X\",\"J\",\"V\",\"S\")","v":"D"},{"$f":"CHOOSE(1+MOD($AL$5+2-2,7),\"D\",\"L\",\"M\",\"X\",\"J\",\"V\",\"S\")","v":"L"},{"$f":"CHOOSE(1+MOD($AL$5+3-2,7),\"D\",\"L\",\"M\",\"X\",\"J\",\"V\",\"S\")","v":"M"},{"$f":"CHOOSE(1+MOD($AL$5+4-2,7),\"D\",\"L\",\"M\",\"X\",\"J\",\"V\",\"S\")","v":"X"},{"$f":"CHOOSE(1+MOD($AL$5+5-2,7),\"D\",\"L\",\"M\",\"X\",\"J\",\"V\",\"S\")","v":"J"},{"$f":"CHOOSE(1+MOD($AL$5+6-2,7),\"D\",\"L\",\"M\",\"X\",\"J\",\"V\",\"S\")","v":"V"},{"$f":"CHOOSE(1+MOD($AL$5+7-2,7),\"D\",\"L\",\"M\",\"X\",\"J\",\"V\",\"S\")","v":"S"},null,null,"End",{"$f":"+'Home Page'!C14","v":"2019-12-19"},null,null,null,"2019-01-05","2019-01-01"]
[{"$f":"IF(WEEKDAY(A8,1)=$AL$5,A8,\"\")","v":""},{"$f":"IF(A10=\"\",IF(WEEKDAY(A8,1)=MOD($AL$5,7)+1,A8,\"\"),A10+1)","v":""},{"$f":"IF(B10=\"\",IF(WEEKDAY(A8,1)=MOD($AL$5+1,7)+1,A8,\"\"),B10+1)","v":"2019-01-01"},{"$f":"IF(C10=\"\",IF(WEEKDAY(A8,1)=MOD($AL$5+2,7)+1,A8,\"\"),C10+1)","v":"2019-01-02"},{"$f":"IF(D10=\"\",IF(WEEKDAY(A8,1)=MOD($AL$5+3,7)+1,A8,\"\"),D10+1)","v":"2019-01-03"},{"$f":"IF(E10=\"\",IF(WEEKDAY(A8,1)=MOD($AL$5+4,7)+1,A8,\"\"),E10+1)","v":"2019-01-04"},{"$f":"IF(F10=\"\",IF(WEEKDAY(A8,1)=MOD($AL$5+5,7)+1,A8,\"\"),F10+1)","v":"2019-01-05"},null,{"$f":"IF(WEEKDAY(I8,1)=$AL$5,I8,\"\")","v":""},{"$f":"IF(I10=\"\",IF(WEEKDAY(I8,1)=MOD($AL$5,7)+1,I8,\"\"),I10+1)","v":""},{"$f":"IF(J10=\"\",IF(WEEKDAY(I8,1)=MOD($AL$5+1,7)+1,I8,\"\"),J10+1)","v":""},{"$f":"IF(K10=\"\",IF(WEEKDAY(I8,1)=MOD($AL$5+2,7)+1,I8,\"\"),K10+1)","v":""},{"$f":"IF(L10=\"\",IF(WEEKDAY(I8,1)=MOD($AL$5+3,7)+1,I8,\"\"),L10+1)","v":""},{"$f":"IF(M10=\"\",IF(WEEKDAY(I8,1)=MOD($AL$5+4,7)+1,I8,\"\"),M10+1)","v":"2019-02-01"},{"$f":"IF(N10=\"\",IF(WEEKDAY(I8,1)=MOD($AL$5+5,7)+1,I8,\"\"),N10+1)","v":"2019-02-02"},null,{"$f":"IF(WEEKDAY(Q8,1)=$AL$5,Q8,\"\")","v":""},{"$f":"IF(Q10=\"\",IF(WEEKDAY(Q8,1)=MOD($AL$5,7)+1,Q8,\"\"),Q10+1)","v":""},{"$f":"IF(R10=\"\",IF(WEEKDAY(Q8,1)=MOD($AL$5+1,7)+1,Q8,\"\"),R10+1)","v":""},{"$f":"IF(S10=\"\",IF(WEEKDAY(Q8,1)=MOD($AL$5+2,7)+1,Q8,\"\"),S10+1)","v":""},{"$f":"IF(T10=\"\",IF(WEEKDAY(Q8,1)=MOD($AL$5+3,7)+1,Q8,\"\"),T10+1)","v":""},{"$f":"IF(U10=\"\",IF(WEEKDAY(Q8,1)=MOD($AL$5+4,7)+1,Q8,\"\"),U10+1)","v":"2019-03-01"},{"$f":"IF(V10=\"\",IF(WEEKDAY(Q8,1)=MOD($AL$5+5,7)+1,Q8,\"\"),V10+1)","v":"2019-03-02"},null,{"$f":"IF(WEEKDAY(Y8,1)=$AL$5,Y8,\"\")","v":""},{"$f":"IF(Y10=\"\",IF(WEEKDAY(Y8,1)=MOD($AL$5,7)+1,Y8,\"\"),Y10+1)","v":"2019-04-01"},{"$f":"IF(Z10=\"\",IF(WEEKDAY(Y8,1)=MOD($AL$5+1,7)+1,Y8,\"\"),Z10+1)","v":"2019-04-02"},{"$f":"IF(AA10=\"\",IF(WEEKDAY(Y8,1)=MOD($AL$5+2,7)+1,Y8,\"\"),AA10+1)","v":"2019-04-03"},{"$f":"IF(AB10=\"\",IF(WEEKDAY(Y8,1)=MOD($AL$5+3,7)+1,Y8,\"\"),AB10+1)","v":"2019-04-04"},{"$f":"IF(AC10=\"\",IF(WEEKDAY(Y8,1)=MOD($AL$5+4,7)+1,Y8,\"\"),AC10+1)","v":"2019-04-05"},{"$f":"IF(AD10=\"\",IF(WEEKDAY(Y8,1)=MOD($AL$5+5,7)+1,Y8,\"\"),AD10+1)","v":"2019-04-06"},null,null,null,null,null,{"$f":"IF(AI$8=\"\",\"\",AI$8)","v":"2019-01-08"},{"$f":"IF(AL$7=\"\",\"\",AL$7)","v":"2019-01-10"},"2019-01-06","2019-01-02"]
[{"$f":"IF(G10=\"\",\"\",IF(MONTH(G10+1)<>MONTH(G10),\"\",G10+1))","v":"2019-01-06"},{"$f":"IF(A11=\"\",\"\",IF(MONTH(A11+1)<>MONTH(A11),\"\",A11+1))","v":"2019-01-07"},{"$f":"IF(B11=\"\",\"\",IF(MONTH(B11+1)<>MONTH(B11),\"\",B11+1))","v":"2019-01-08"},"2019-01-09","2019-01-10","2019-01-11","2019-01-12",null,{"$f":"IF(O10=\"\",\"\",IF(MONTH(O10+1)<>MONTH(O10),\"\",O10+1))","v":"2019-02-03"},{"$f":"IF(I11=\"\",\"\",IF(MONTH(I11+1)<>MONTH(I11),\"\",I11+1))","v":"2019-02-04"},{"$f":"IF(J11=\"\",\"\",IF(MONTH(J11+1)<>MONTH(J11),\"\",J11+1))","v":"2019-02-05"},{"$f":"IF(K11=\"\",\"\",IF(MONTH(K11+1)<>MONTH(K11),\"\",K11+1))","v":"2019-02-06"},{"$f":"IF(L11=\"\",\"\",IF(MONTH(L11+1)<>MONTH(L11),\"\",L11+1))","v":"2019-02-07"},{"$f":"IF(M11=\"\",\"\",IF(MONTH(M11+1)<>MONTH(M11),\"\",M11+1))","v":"2019-02-08"},{"$f":"IF(N11=\"\",\"\",IF(MONTH(N11+1)<>MONTH(N11),\"\",N11+1))","v":"2019-02-09"},null,{"$f":"IF(W10=\"\",\"\",IF(MONTH(W10+1)<>MONTH(W10),\"\",W10+1))","v":"2019-03-03"},{"$f":"IF(Q11=\"\",\"\",IF(MONTH(Q11+1)<>MONTH(Q11),\"\",Q11+1))","v":"2019-03-04"},{"$f":"IF(R11=\"\",\"\",IF(MONTH(R11+1)<>MONTH(R11),\"\",R11+1))","v":"2019-03-05"},{"$f":"IF(S11=\"\",\"\",IF(MONTH(S11+1)<>MONTH(S11),\"\",S11+1))","v":"2019-03-06"},{"$f":"IF(T11=\"\",\"\",IF(MONTH(T11+1)<>MONTH(T11),\"\",T11+1))","v":"2019-03-07"},{"$f":"IF(U11=\"\",\"\",IF(MONTH(U11+1)<>MONTH(U11),\"\",U11+1))","v":"2019-03-08"},{"$f":"IF(V11=\"\",\"\",IF(MONTH(V11+1)<>MONTH(V11),\"\",V11+1))","v":"2019-03-09"},null,{"$f":"IF(AE10=\"\",\"\",IF(MONTH(AE10+1)<>MONTH(AE10),\"\",AE10+1))","v":"2019-04-07"},{"$f":"IF(Y11=\"\",\"\",IF(MONTH(Y11+1)<>MONTH(Y11),\"\",Y11+1))","v":"2019-04-08"},{"$f":"IF(Z11=\"\",\"\",IF(MONTH(Z11+1)<>MONTH(Z11),\"\",Z11+1))","v":"2019-04-09"},{"$f":"IF(AA11=\"\",\"\",IF(MONTH(AA11+1)<>MONTH(AA11),\"\",AA11+1))","v":"2019-04-10"},{"$f":"IF(AB11=\"\",\"\",IF(MONTH(AB11+1)<>MONTH(AB11),\"\",AB11+1))","v":"2019-04-11"},{"$f":"IF(AC11=\"\",\"\",IF(MONTH(AC11+1)<>MONTH(AC11),\"\",AC11+1))","v":"2019-04-12"},{"$f":"IF(AD11=\"\",\"\",IF(MONTH(AD11+1)<>MONTH(AD11),\"\",AD11+1))","v":"2019-04-13"},null,null,"Days","Day 1",null,{"$f":"IF(AK10=\"\",\"\",IF(AK10+7<=AI$9,AK10+7,\"\"))","v":"2019-01-15"},{"$f":"IF(AL10=\"\",\"\",IF(AL10+7<=AL$8,AL10+7,\"\"))","v":"2019-01-17"},{"$f":"+AM9+7","v":"2019-01-12"},"2019-01-03"]
[{"$f":"IF(G11=\"\",\"\",IF(MONTH(G11+1)<>MONTH(G11),\"\",G11+1))","v":"2019-01-13"},{"$f":"IF(A12=\"\",\"\",IF(MONTH(A12+1)<>MONTH(A12),\"\",A12+1))","v":"2019-01-14"},"2019-01-15","2019-01-16","2019-01-17","2019-01-18","2019-01-19",null,{"$f":"IF(O11=\"\",\"\",IF(MONTH(O11+1)<>MONTH(O11),\"\",O11+1))","v":"2019-02-10"},{"$f":"IF(I12=\"\",\"\",IF(MONTH(I12+1)<>MONTH(I12),\"\",I12+1))","v":"2019-02-11"},"2019-02-12","2019-02-13","2019-02-14","2019-02-15","2019-02-16",null,{"$f":"IF(W11=\"\",\"\",IF(MONTH(W11+1)<>MONTH(W11),\"\",W11+1))","v":"2019-03-10"},{"$f":"IF(Q12=\"\",\"\",IF(MONTH(Q12+1)<>MONTH(Q12),\"\",Q12+1))","v":"2019-03-11"},"2019-03-12","2019-03-13","2019-03-14","2019-03-15","2019-03-16",null,{"$f":"IF(AE11=\"\",\"\",IF(MONTH(AE11+1)<>MONTH(AE11),\"\",AE11+1))","v":"2019-04-14"},{"$f":"IF(Y12=\"\",\"\",IF(MONTH(Y12+1)<>MONTH(Y12),\"\",Y12+1))","v":"2019-04-15"},"2019-04-16","2019-04-17","2019-04-18","2019-04-19","2019-04-20",null,null,{"$f":"COUNT(AK7:AK72)","v":50},{"$f":"+'Home Page'!C17","v":"Martes"},null,"2019-01-22","2019-01-24","2019-01-13","2019-01-04"]
["2019-01-20","2019-01-21","2019-01-22","2019-01-23","2019-01-24","2019-01-25","2019-01-26",null,"2019-02-17","2019-02-18","2019-02-19","2019-02-20","2019-02-21","2019-02-22","2019-02-23",null,"2019-03-17","2019-03-18","2019-03-19","2019-03-20","2019-03-21","2019-03-22","2019-03-23",null,"2019-04-21","2019-04-22","2019-04-23","2019-04-24","2019-04-25","2019-04-26","2019-04-27",null,null,null,"Day 2",null,"2019-01-29","2019-01-31","2019-01-19","2019-04-15"]
["2019-01-27","2019-01-28","2019-01-29","2019-01-30","2019-01-31","","",null,"2019-02-24","2019-02-25","2019-02-26","2019-02-27","2019-02-28","","",null,"2019-03-24","2019-03-25","2019-03-26","2019-03-27","2019-03-28","2019-03-29","2019-03-30",null,"2019-04-28","2019-04-29","2019-04-30","","","","",null,null,{"$f":"COUNT(AL7:AL72)","v":52},{"$f":"+'Home Page'!C19","v":"Jueves"},null,"2019-02-05","2019-02-07","2019-01-20","2019-04-16"]
["","","","","","","",null,"","","","","","","","[42]","2019-03-31","","","","","","",null,"","","","","","","",null,null,null,null,null,"2019-02-12","2019-02-14","2019-01-26","2019-04-17"]
[null,null,null,null,null,null,null,null,null,null,null,null,null,null,null,null,null,null,null,null,null,null,null,null,null,null,null,null,null,null,null,null,null,"Class ",null,null,"2019-02-19","2019-02-21","2019-01-27","2019-04-18"]
[{"$f":"DATE(YEAR(Y8+35),MONTH(Y8+35),1)","v":"2019-05-01"},null,null,null,null,null,null,null,{"$f":"DATE(YEAR(A17+35),MONTH(A17+35),1)","v":"2019-06-01"},null,null,null,null,null,null,null,{"$f":"DATE(YEAR(I17+35),MONTH(I17+35),1)","v":"2019-07-01"},null,null,null,null,null,null,null,{"$f":"DATE(YEAR(Q17+35),MONTH(Q17+35),1)","v":"2019-08-01"},null,null,null,null,null,null,null,null,"Start ",{"$f":"+'Home Page'!C22","v":"16:30:00"},null,"2019-02-26","2019-02-28","2019-02-02","2019-04-19"]
[{"$f":"CHOOSE(1+MOD($AL$5+1-2,7),\"D\",\"L\",\"M\",\"X\",\"J\",\"V\",\"S\")","v":"D"},{"$f":"CHOOSE(1+MOD($AL$5+2-2,7),\"D\",\"L\",\"M\",\"X\",\"J\",\"V\",\"S\")","v":"L"},{"$f":"CHOOSE(1+MOD($AL$5+3-2,7),\"D\",\"L\",\"M\",\"X\",\"J\",\"V\",\"S\")","v":"M"},{"$f":"CHOOSE(1+MOD($AL$5+4-2,7),\"D\",\"L\",\"M\",\"X\",\"J\",\"V\",\"S\")","v":"X"},{"$f":"CHOOSE(1+MOD($AL$5+5-2,7),\"D\",\"L\",\"M\",\"X\",\"J\",\"V\",\"S\")","v":"J"},{"$f":"CHOOSE(1+MOD($AL$5+6-2,7),\"D\",\"L\",\"M\",\"X\",\"J\",\"V\",\"S\")","v":"V"},{"$f":"CHOOSE(1+MOD($AL$5+7-2,7),\"D\",\"L\",\"M\",\"X\",\"J\",\"V\",\"S\")","v":"S"},null,{"$f":"CHOOSE(1+MOD($AL$5+1-2,7),\"D\",\"L\",\"M\",\"X\",\"J\",\"V\",\"S\")","v":"D"},{"$f":"CHOOSE(1+MOD($AL$5+2-2,7),\"D\",\"L\",\"M\",\"X\",\"J\",\"V\",\"S\")","v":"L"},{"$f":"CHOOSE(1+MOD($AL$5+3-2,7),\"D\",\"L\",\"M\",\"X\",\"J\",\"V\",\"S\")","v":"M"},{"$f":"CHOOSE(1+MOD($AL$5+4-2,7),\"D\",\"L\",\"M\",\"X\",\"J\",\"V\",\"S\")","v":"X"},{"$f":"CHOOSE(1+MOD($AL$5+5-2,7),\"D\",\"L\",\"M\",\"X\",\"J\",\"V\",\"S\")","v":"J"},{"$f":"CHOOSE(1+MOD($AL$5+6-2,7),\"D\",\"L\",\"M\",\"X\",\"J\",\"V\",\"S\")","v":"V"},{"$f":"CHOOSE(1+MOD($AL$5+7-2,7),\"D\",\"L\",\"M\",\"X\",\"J\",\"V\",\"S\")","v":"S"},null,{"$f":"CHOOSE(1+MOD($AL$5+1-2,7),\"D\",\"L\",\"M\",\"X\",\"J\",\"V\",\"S\")","v":"D"},{"$f":"CHOOSE(1+MOD($AL$5+2-2,7),\"D\",\"L\",\"M\",\"X\",\"J\",\"V\",\"S\")","v":"L"},{"$f":"CHOOSE(1+MOD($AL$5+3-2,7),\"D\",\"L\",\"M\",\"X\",\"J\",\"V\",\"S\")","v":"M"},{"$f":"CHOOSE(1+MOD($AL$5+4-2,7),\"D\",\"L\",\"M\",\"X\",\"J\",\"V\",\"S\")","v":"X"},{"$f":"CHOOSE(1+MOD($AL$5+5-2,7),\"D\",\"L\",\"M\",\"X\",\"J\",\"V\",\"S\")","v":"J"},{"$f":"CHOOSE(1+MOD($AL$5+6-2,7),\"D\",\"L\",\"M\",\"X\",\"J\",\"V\",\"S\")","v":"V"},{"$f":"CHOOSE(1+MOD($AL$5+7-2,7),\"D\",\"L\",\"M\",\"X\",\"J\",\"V\",\"S\")","v":"S"},null,{"$f":"CHOOSE(1+MOD($AL$5+1-2,7),\"D\",\"L\",\"M\",\"X\",\"J\",\"V\",\"S\")","v":"D"},{"$f":"CHOOSE(1+MOD($AL$5+2-2,7),\"D\",\"L\",\"M\",\"X\",\"J\",\"V\",\"S\")","v":"L"},{"$f":"CHOOSE(1+MOD($AL$5+3-2,7),\"D\",\"L\",\"M\",\"X\",\"J\",\"V\",\"S\")","v":"M"},{"$f":"CHOOSE(1+MOD($AL$5+4-2,7),\"D\",\"L\",\"M\",\"X\",\"J\",\"V\",\"S\")","v":"X"},{"$f":"CHOOSE(1+MOD($AL$5+5-2,7),\"D\",\"L\",\"M\",\"X\",\"J\",\"V\",\"S\")","v":"J"},{"$f":"CHOOSE(1+MOD($AL$5+6-2,7),\"D\",\"L\",\"M\",\"X\",\"J\",\"V\",\"S\")","v":"V"},{"$f":"CHOOSE(1+MOD($AL$5+7-2,7),\"D\",\"L\",\"M\",\"X\",\"J\",\"V\",\"S\")","v":"S"},null,null,"End",{"$f":"+'Home Page'!C23","v":"18:30:00"},null,"2019-03-05","2019-03-07","2019-02-03","2019-04-22"]
[{"$f":"IF(WEEKDAY(A17,1)=$AL$5,A17,\"\")","v":""},{"$f":"IF(A19=\"\",IF(WEEKDAY(A17,1)=MOD($AL$5,7)+1,A17,\"\"),A19+1)","v":""},{"$f":"IF(B19=\"\",IF(WEEKDAY(A17,1)=MOD($AL$5+1,7)+1,A17,\"\"),B19+1)","v":""},{"$f":"IF(C19=\"\",IF(WEEKDAY(A17,1)=MOD($AL$5+2,7)+1,A17,\"\"),C19+1)","v":"2019-05-01"},{"$f":"IF(D19=\"\",IF(WEEKDAY(A17,1)=MOD($AL$5+3,7)+1,A17,\"\"),D19+1)","v":"2019-05-02"},{"$f":"IF(E19=\"\",IF(WEEKDAY(A17,1)=MOD($AL$5+4,7)+1,A17,\"\"),E19+1)","v":"2019-05-03"},{"$f":"IF(F19=\"\",IF(WEEKDAY(A17,1)=MOD($AL$5+5,7)+1,A17,\"\"),F19+1)","v":"2019-05-04"},null,{"$f":"IF(WEEKDAY(I17,1)=$AL$5,I17,\"\")","v":""},{"$f":"IF(I19=\"\",IF(WEEKDAY(I17,1)=MOD($AL$5,7)+1,I17,\"\"),I19+1)","v":""},{"$f":"IF(J19=\"\",IF(WEEKDAY(I17,1)=MOD($AL$5+1,7)+1,I17,\"\"),J19+1)","v":""},{"$f":"IF(K19=\"\",IF(WEEKDAY(I17,1)=MOD($AL$5+2,7)+1,I17,\"\"),K19+1)","v":""},{"$f":"IF(L19=\"\",IF(WEEKDAY(I17,1)=MOD($AL$5+3,7)+1,I17,\"\"),L19+1)","v":""},{"$f":"IF(M19=\"\",IF(WEEKDAY(I17,1)=MOD($AL$5+4,7)+1,I17,\"\"),M19+1)","v":""},{"$f":"IF(N19=\"\",IF(WEEKDAY(I17,1)=MOD($AL$5+5,7)+1,I17,\"\"),N19+1)","v":"2019-06-01"},null,{"$f":"IF(WEEKDAY(Q17,1)=$AL$5,Q17,\"\")","v":""},{"$f":"IF(Q19=\"\",IF(WEEKDAY(Q17,1)=MOD($AL$5,7)+1,Q17,\"\"),Q19+1)","v":"2019-07-01"},{"$f":"IF(R19=\"\",IF(WEEKDAY(Q17,1)=MOD($AL$5+1,7)+1,Q17,\"\"),R19+1)","v":"2019-07-02"},{"$f":"IF(S19=\"\",IF(WEEKDAY(Q17,1)=MOD($AL$5+2,7)+1,Q17,\"\"),S19+1)","v":"2019-07-03"},{"$f":"IF(T19=\"\",IF(WEEKDAY(Q17,1)=MOD($AL$5+3,7)+1,Q17,\"\"),T19+1)","v":"2019-07-04"},{"$f":"IF(U19=\"\",IF(WEEKDAY(Q17,1)=MOD($AL$5+4,7)+1,Q17,\"\"),U19+1)","v":"2019-07-05"},{"$f":"IF(V19=\"\",IF(WEEKDAY(Q17,1)=MOD($AL$5+5,7)+1,Q17,\"\"),V19+1)","v":"2019-07-06"},null,{"$f":"IF(WEEKDAY(Y17,1)=$AL$5,Y17,\"\")","v":""},{"$f":"IF(Y19=\"\",IF(WEEKDAY(Y17,1)=MOD($AL$5,7)+1,Y17,\"\"),Y19+1)","v":""},{"$f":"IF(Z19=\"\",IF(WEEKDAY(Y17,1)=MOD($AL$5+1,7)+1,Y17,\"\"),Z19+1)","v":""},{"$f":"IF(AA19=\"\",IF(WEEKDAY(Y17,1)=MOD($AL$5+2,7)+1,Y17,\"\"),AA19+1)","v":""},{"$f":"IF(AB19=\"\",IF(WEEKDAY(Y17,1)=MOD($AL$5+3,7)+1,Y17,\"\"),AB19+1)","v":"2019-08-01"},{"$f":"IF(AC19=\"\",IF(WEEKDAY(Y17,1)=MOD($AL$5+4,7)+1,Y17,\"\"),AC19+1)","v":"2019-08-02"},{"$f":"IF(AD19=\"\",IF(WEEKDAY(Y17,1)=MOD($AL$5+5,7)+1,Y17,\"\"),AD19+1)","v":"2019-08-03"},null,null,null,null,null,"2019-03-12","2019-03-14","2019-02-09","2019-05-01"]
[{"$f":"IF(G19=\"\",\"\",IF(MONTH(G19+1)<>MONTH(G19),\"\",G19+1))","v":"2019-05-05"},{"$f":"IF(A20=\"\",\"\",IF(MONTH(A20+1)<>MONTH(A20),\"\",A20+1))","v":"2019-05-06"},{"$f":"IF(B20=\"\",\"\",IF(MONTH(B20+1)<>MONTH(B20),\"\",B20+1))","v":"2019-05-07"},{"$f":"IF(C20=\"\",\"\",IF(MONTH(C20+1)<>MONTH(C20),\"\",C20+1))","v":"2019-05-08"},{"$f":"IF(D20=\"\",\"\",IF(MONTH(D20+1)<>MONTH(D20),\"\",D20+1))","v":"2019-05-09"},{"$f":"IF(E20=\"\",\"\",IF(MONTH(E20+1)<>MONTH(E20),\"\",E20+1))","v":"2019-05-10"},{"$f":"IF(F20=\"\",\"\",IF(MONTH(F20+1)<>MONTH(F20),\"\",F20+1))","v":"2019-05-11"},null,{"$f":"IF(O19=\"\",\"\",IF(MONTH(O19+1)<>MONTH(O19),\"\",O19+1))","v":"2019-06-02"},{"$f":"IF(I20=\"\",\"\",IF(MONTH(I20+1)<>MONTH(I20),\"\",I20+1))","v":"2019-06-03"},{"$f":"IF(J20=\"\",\"\",IF(MONTH(J20+1)<>MONTH(J20),\"\",J20+1))","v":"2019-06-04"},{"$f":"IF(K20=\"\",\"\",IF(MONTH(K20+1)<>MONTH(K20),\"\",K20+1))","v":"2019-06-05"},{"$f":"IF(L20=\"\",\"\",IF(MONTH(L20+1)<>MONTH(L20),\"\",L20+1))","v":"2019-06-06"},{"$f":"IF(M20=\"\",\"\",IF(MONTH(M20+1)<>MONTH(M20),\"\",M20+1))","v":"2019-06-07"},{"$f":"IF(N20=\"\",\"\",IF(MONTH(N20+1)<>MONTH(N20),\"\",N20+1))","v":"2019-06-08"},null,{"$f":"IF(W19=\"\",\"\",IF(MONTH(W19+1)<>MONTH(W19),\"\",W19+1))","v":"2019-07-07"},{"$f":"IF(Q20=\"\",\"\",IF(MONTH(Q20+1)<>MONTH(Q20),\"\",Q20+1))","v":"2019-07-08"},{"$f":"IF(R20=\"\",\"\",IF(MONTH(R20+1)<>MONTH(R20),\"\",R20+1))","v":"2019-07-09"},{"$f":"IF(S20=\"\",\"\",IF(MONTH(S20+1)<>MONTH(S20),\"\",S20+1))","v":"2019-07-10"},{"$f":"IF(T20=\"\",\"\",IF(MONTH(T20+1)<>MONTH(T20),\"\",T20+1))","v":"2019-07-11"},{"$f":"IF(U20=\"\",\"\",IF(MONTH(U20+1)<>MONTH(U20),\"\",U20+1))","v":"2019-07-12"},{"$f":"IF(V20=\"\",\"\",IF(MONTH(V20+1)<>MONTH(V20),\"\",V20+1))","v":"2019-07-13"},null,{"$f":"IF(AE19=\"\",\"\",IF(MONTH(AE19+1)<>MONTH(AE19),\"\",AE19+1))","v":"2019-08-04"},{"$f":"IF(Y20=\"\",\"\",IF(MONTH(Y20+1)<>MONTH(Y20),\"\",Y20+1))","v":"2019-08-05"},{"$f":"IF(Z20=\"\",\"\",IF(MONTH(Z20+1)<>MONTH(Z20),\"\",Z20+1))","v":"2019-08-06"},{"$f":"IF(AA20=\"\",\"\",IF(MONTH(AA20+1)<>MONTH(AA20),\"\",AA20+1))","v":"2019-08-07"},{"$f":"IF(AB20=\"\",\"\",IF(MONTH(AB20+1)<>MONTH(AB20),\"\",AB20+1))","v":"2019-08-08"},{"$f":"IF(AC20=\"\",\"\",IF(MONTH(AC20+1)<>MONTH(AC20),\"\",AC20+1))","v":"2019-08-09"},{"$f":"IF(AD20=\"\",\"\",IF(MONTH(AD20+1)<>MONTH(AD20),\"\",AD20+1))","v":"2019-08-10"},null,null,null,null,null,"2019-03-19","2019-03-21","2019-02-10","2019-06-10"]
[{"$f":"IF(G20=\"\",\"\",IF(MONTH(G20+1)<>MONTH(G20),\"\",G20+1))","v":"2019-05-12"},{"$f":"IF(A21=\"\",\"\",IF(MONTH(A21+1)<>MONTH(A21),\"\",A21+1))","v":"2019-05-13"},"2019-05-14","2019-05-15","2019-05-16","2019-05-17","2019-05-18",null,{"$f":"IF(O20=\"\",\"\",IF(MONTH(O20+1)<>MONTH(O20),\"\",O20+1))","v":"2019-06-09"},{"$f":"IF(I21=\"\",\"\",IF(MONTH(I21+1)<>MONTH(I21),\"\",I21+1))","v":"2019-06-10"},"2019-06-11","2019-06-12","2019-06-13","2019-06-14","2019-06-15",null,{"$f":"IF(W20=\"\",\"\",IF(MONTH(W20+1)<>MONTH(W20),\"\",W20+1))","v":"2019-07-14"},{"$f":"IF(Q21=\"\",\"\",IF(MONTH(Q21+1)<>MONTH(Q21),\"\",Q21+1))","v":"2019-07-15"},"2019-07-16","2019-07-17","2019-07-18","2019-07-19","2019-07-20",null,{"$f":"IF(AE20=\"\",\"\",IF(MONTH(AE20+1)<>MONTH(AE20),\"\",AE20+1))","v":"2019-08-11"},{"$f":"IF(Y21=\"\",\"\",IF(MONTH(Y21+1)<>MONTH(Y21),\"\",Y21+1))","v":"2019-08-12"},"2019-08-13","2019-08-14","2019-08-15","2019-08-16","2019-08-17",null,null,"Teacher",{"$f":"+'Home Page'!F6","v":"Chris"},null,"2019-03-26","2019-03-28","2019-02-16","2019-06-24"]
["2019-05-19","2019-05-20","2019-05-21","2019-05-22","2019-05-23","2019-05-24","2019-05-25",null,"2019-06-16","2019-06-17","2019-06-18","2019-06-19","2019-06-20","2019-06-21","2019-06-22",null,"2019-07-21","2019-07-22","2019-07-23","2019-07-24","2019-07-25","2019-07-26","2019-07-27",null,"2019-08-18","2019-08-19","2019-08-20","2019-08-21","2019-08-22","2019-08-23","2019-08-24",null,null,null,null,null,"2019-04-02","2019-04-04","2019-02-17","2019-07-29"]
["2019-05-26","2019-05-27","2019-05-28","2019-05-29","2019-05-30","2019-05-31","",null,"2019-06-23","2019-06-24","2019-06-25","2019-06-26","2019-06-27","2019-06-28","2019-06-29",null,"2019-07-28","2019-07-29","2019-07-30","2019-07-31","","","",null,"2019-08-25","2019-08-26","2019-08-27","2019-08-28","2019-08-29","2019-08-30","2019-08-31",null,null,"Students",null,null,"2019-04-09","2019-04-11","2019-02-23",{"$f":"+AN22+1","v":"2019-07-30"}]
["","","","","","","",null,"2019-06-30","","","","","","","[42]","","","","","","","",null,"","","","","","","",null,null,1,{"$f":"+'Home Page'!F9","v":"Rod"},null,"2019-04-16","2019-04-18","2019-02-24",{"$f":"+AN23+1","v":"2019-07-31"}]
[null,null,null,null,null,null,null,null,null,null,null,null,null,null,null,null,null,null,null,null,null,null,null,null,null,null,null,null,null,null,null,null,null,2,{"$f":"+'Home Page'!F10","v":"Jane"},null,"2019-04-23","2019-04-25","2019-03-02","2019-09-11"]
[{"$f":"DATE(YEAR(Y17+35),MONTH(Y17+35),1)","v":"2019-09-01"},null,null,null,null,null,null,null,{"$f":"DATE(YEAR(A26+35),MONTH(A26+35),1)","v":"2019-10-01"},null,null,null,null,null,null,null,{"$f":"DATE(YEAR(I26+35),MONTH(I26+35),1)","v":"2019-11-01"},null,null,null,null,null,null,null,{"$f":"DATE(YEAR(Q26+35),MONTH(Q26+35),1)","v":"2019-12-01"},null,null,null,null,null,null,null,null,3,{"$f":"+'Home Page'!F11","v":"Freddy"},null,"2019-04-30","2019-05-02","2019-03-03","2019-09-24"]
[{"$f":"CHOOSE(1+MOD($AL$5+1-2,7),\"D\",\"L\",\"M\",\"X\",\"J\",\"V\",\"S\")","v":"D"},{"$f":"CHOOSE(1+MOD($AL$5+2-2,7),\"D\",\"L\",\"M\",\"X\",\"J\",\"V\",\"S\")","v":"L"},{"$f":"CHOOSE(1+MOD($AL$5+3-2,7),\"D\",\"L\",\"M\",\"X\",\"J\",\"V\",\"S\")","v":"M"},{"$f":"CHOOSE(1+MOD($AL$5+4-2,7),\"D\",\"L\",\"M\",\"X\",\"J\",\"V\",\"S\")","v":"X"},{"$f":"CHOOSE(1+MOD($AL$5+5-2,7),\"D\",\"L\",\"M\",\"X\",\"J\",\"V\",\"S\")","v":"J"},{"$f":"CHOOSE(1+MOD($AL$5+6-2,7),\"D\",\"L\",\"M\",\"X\",\"J\",\"V\",\"S\")","v":"V"},{"$f":"CHOOSE(1+MOD($AL$5+7-2,7),\"D\",\"L\",\"M\",\"X\",\"J\",\"V\",\"S\")","v":"S"},null,{"$f":"CHOOSE(1+MOD($AL$5+1-2,7),\"D\",\"L\",\"M\",\"X\",\"J\",\"V\",\"S\")","v":"D"},{"$f":"CHOOSE(1+MOD($AL$5+2-2,7),\"D\",\"L\",\"M\",\"X\",\"J\",\"V\",\"S\")","v":"L"},{"$f":"CHOOSE(1+MOD($AL$5+3-2,7),\"D\",\"L\",\"M\",\"X\",\"J\",\"V\",\"S\")","v":"M"},{"$f":"CHOOSE(1+MOD($AL$5+4-2,7),\"D\",\"L\",\"M\",\"X\",\"J\",\"V\",\"S\")","v":"X"},{"$f":"CHOOSE(1+MOD($AL$5+5-2,7),\"D\",\"L\",\"M\",\"X\",\"J\",\"V\",\"S\")","v":"J"},{"$f":"CHOOSE(1+MOD($AL$5+6-2,7),\"D\",\"L\",\"M\",\"X\",\"J\",\"V\",\"S\")","v":"V"},{"$f":"CHOOSE(1+MOD($AL$5+7-2,7),\"D\",\"L\",\"M\",\"X\",\"J\",\"V\",\"S\")","v":"S"},null,{"$f":"CHOOSE(1+MOD($AL$5+1-2,7),\"D\",\"L\",\"M\",\"X\",\"J\",\"V\",\"S\")","v":"D"},{"$f":"CHOOSE(1+MOD($AL$5+2-2,7),\"D\",\"L\",\"M\",\"X\",\"J\",\"V\",\"S\")","v":"L"},{"$f":"CHOOSE(1+MOD($AL$5+3-2,7),\"D\",\"L\",\"M\",\"X\",\"J\",\"V\",\"S\")","v":"M"},{"$f":"CHOOSE(1+MOD($AL$5+4-2,7),\"D\",\"L\",\"M\",\"X\",\"J\",\"V\",\"S\")","v":"X"},{"$f":"CHOOSE(1+MOD($AL$5+5-2,7),\"D\",\"L\",\"M\",\"X\",\"J\",\"V\",\"S\")","v":"J"},{"$f":"CHOOSE(1+MOD($AL$5+6-2,7),\"D\",\"L\",\"M\",\"X\",\"J\",\"V\",\"S\")","v":"V"},{"$f":"CHOOSE(1+MOD($AL$5+7-2,7),\"D\",\"L\",\"M\",\"X\",\"J\",\"V\",\"S\")","v":"S"},null,{"$f":"CHOOSE(1+MOD($AL$5+1-2,7),\"D\",\"L\",\"M\",\"X\",\"J\",\"V\",\"S\")","v":"D"},{"$f":"CHOOSE(1+MOD($AL$5+2-2,7),\"D\",\"L\",\"M\",\"X\",\"J\",\"V\",\"S\")","v":"L"},{"$f":"CHOOSE(1+MOD($AL$5+3-2,7),\"D\",\"L\",\"M\",\"X\",\"J\",\"V\",\"S\")","v":"M"},{"$f":"CHOOSE(1+MOD($AL$5+4-2,7),\"D\",\"L\",\"M\",\"X\",\"J\",\"V\",\"S\")","v":"X"},{"$f":"CHOOSE(1+MOD($AL$5+5-2,7),\"D\",\"L\",\"M\",\"X\",\"J\",\"V\",\"S\")","v":"J"},{"$f":"CHOOSE(1+MOD($AL$5+6-2,7),\"D\",\"L\",\"M\",\"X\",\"J\",\"V\",\"S\")","v":"V"},{"$f":"CHOOSE(1+MOD($AL$5+7-2,7),\"D\",\"L\",\"M\",\"X\",\"J\",\"V\",\"S\")","v":"S"},null,null,4,{"$f":"+'Home Page'!F12","v":"George"},null,"2019-05-07","2019-05-09","2019-03-09","2019-10-12"]
[{"$f":"IF(WEEKDAY(A26,1)=$AL$5,A26,\"\")","v":"2019-09-01"},{"$f":"IF(A28=\"\",IF(WEEKDAY(A26,1)=MOD($AL$5,7)+1,A26,\"\"),A28+1)","v":"2019-09-02"},{"$f":"IF(B28=\"\",IF(WEEKDAY(A26,1)=MOD($AL$5+1,7)+1,A26,\"\"),B28+1)","v":"2019-09-03"},{"$f":"IF(C28=\"\",IF(WEEKDAY(A26,1)=MOD($AL$5+2,7)+1,A26,\"\"),C28+1)","v":"2019-09-04"},{"$f":"IF(D28=\"\",IF(WEEKDAY(A26,1)=MOD($AL$5+3,7)+1,A26,\"\"),D28+1)","v":"2019-09-05"},{"$f":"IF(E28=\"\",IF(WEEKDAY(A26,1)=MOD($AL$5+4,7)+1,A26,\"\"),E28+1)","v":"2019-09-06"},{"$f":"IF(F28=\"\",IF(WEEKDAY(A26,1)=MOD($AL$5+5,7)+1,A26,\"\"),F28+1)","v":"2019-09-07"},null,{"$f":"IF(WEEKDAY(I26,1)=$AL$5,I26,\"\")","v":""},{"$f":"IF(I28=\"\",IF(WEEKDAY(I26,1)=MOD($AL$5,7)+1,I26,\"\"),I28+1)","v":""},{"$f":"IF(J28=\"\",IF(WEEKDAY(I26,1)=MOD($AL$5+1,7)+1,I26,\"\"),J28+1)","v":"2019-10-01"},{"$f":"IF(K28=\"\",IF(WEEKDAY(I26,1)=MOD($AL$5+2,7)+1,I26,\"\"),K28+1)","v":"2019-10-02"},{"$f":"IF(L28=\"\",IF(WEEKDAY(I26,1)=MOD($AL$5+3,7)+1,I26,\"\"),L28+1)","v":"2019-10-03"},{"$f":"IF(M28=\"\",IF(WEEKDAY(I26,1)=MOD($AL$5+4,7)+1,I26,\"\"),M28+1)","v":"2019-10-04"},{"$f":"IF(N28=\"\",IF(WEEKDAY(I26,1)=MOD($AL$5+5,7)+1,I26,\"\"),N28+1)","v":"2019-10-05"},null,{"$f":"IF(WEEKDAY(Q26,1)=$AL$5,Q26,\"\")","v":""},{"$f":"IF(Q28=\"\",IF(WEEKDAY(Q26,1)=MOD($AL$5,7)+1,Q26,\"\"),Q28+1)","v":""},{"$f":"IF(R28=\"\",IF(WEEKDAY(Q26,1)=MOD($AL$5+1,7)+1,Q26,\"\"),R28+1)","v":""},{"$f":"IF(S28=\"\",IF(WEEKDAY(Q26,1)=MOD($AL$5+2,7)+1,Q26,\"\"),S28+1)","v":""},{"$f":"IF(T28=\"\",IF(WEEKDAY(Q26,1)=MOD($AL$5+3,7)+1,Q26,\"\"),T28+1)","v":""},{"$f":"IF(U28=\"\",IF(WEEKDAY(Q26,1)=MOD($AL$5+4,7)+1,Q26,\"\"),U28+1)","v":"2019-11-01"},{"$f":"IF(V28=\"\",IF(WEEKDAY(Q26,1)=MOD($AL$5+5,7)+1,Q26,\"\"),V28+1)","v":"2019-11-02"},null,{"$f":"IF(WEEKDAY(Y26,1)=$AL$5,Y26,\"\")","v":"2019-12-01"},{"$f":"IF(Y28=\"\",IF(WEEKDAY(Y26,1)=MOD($AL$5,7)+1,Y26,\"\"),Y28+1)","v":"2019-12-02"},{"$f":"IF(Z28=\"\",IF(WEEKDAY(Y26,1)=MOD($AL$5+1,7)+1,Y26,\"\"),Z28+1)","v":"2019-12-03"},{"$f":"IF(AA28=\"\",IF(WEEKDAY(Y26,1)=MOD($AL$5+2,7)+1,Y26,\"\"),AA28+1)","v":"2019-12-04"},{"$f":"IF(AB28=\"\",IF(WEEKDAY(Y26,1)=MOD($AL$5+3,7)+1,Y26,\"\"),AB28+1)","v":"2019-12-05"},{"$f":"IF(AC28=\"\",IF(WEEKDAY(Y26,1)=MOD($AL$5+4,7)+1,Y26,\"\"),AC28+1)","v":"2019-12-06"},{"$f":"IF(AD28=\"\",IF(WEEKDAY(Y26,1)=MOD($AL$5+5,7)+1,Y26,\"\"),AD28+1)","v":"2019-12-07"},null,null,5,{"$f":"+'Home Page'!F13","v":"Bungle"},null,"2019-05-14","2019-05-16","2019-03-10","2019-11-01"]
[{"$f":"IF(G28=\"\",\"\",IF(MONTH(G28+1)<>MONTH(G28),\"\",G28+1))","v":"2019-09-08"},{"$f":"IF(A29=\"\",\"\",IF(MONTH(A29+1)<>MONTH(A29),\"\",A29+1))","v":"2019-09-09"},{"$f":"IF(B29=\"\",\"\",IF(MONTH(B29+1)<>MONTH(B29),\"\",B29+1))","v":"2019-09-10"},{"$f":"IF(C29=\"\",\"\",IF(MONTH(C29+1)<>MONTH(C29),\"\",C29+1))","v":"2019-09-11"},{"$f":"IF(D29=\"\",\"\",IF(MONTH(D29+1)<>MONTH(D29),\"\",D29+1))","v":"2019-09-12"},{"$f":"IF(E29=\"\",\"\",IF(MONTH(E29+1)<>MONTH(E29),\"\",E29+1))","v":"2019-09-13"},{"$f":"IF(F29=\"\",\"\",IF(MONTH(F29+1)<>MONTH(F29),\"\",F29+1))","v":"2019-09-14"},null,{"$f":"IF(O28=\"\",\"\",IF(MONTH(O28+1)<>MONTH(O28),\"\",O28+1))","v":"2019-10-06"},{"$f":"IF(I29=\"\",\"\",IF(MONTH(I29+1)<>MONTH(I29),\"\",I29+1))","v":"2019-10-07"},{"$f":"IF(J29=\"\",\"\",IF(MONTH(J29+1)<>MONTH(J29),\"\",J29+1))","v":"2019-10-08"},{"$f":"IF(K29=\"\",\"\",IF(MONTH(K29+1)<>MONTH(K29),\"\",K29+1))","v":"2019-10-09"},{"$f":"IF(L29=\"\",\"\",IF(MONTH(L29+1)<>MONTH(L29),\"\",L29+1))","v":"2019-10-10"},{"$f":"IF(M29=\"\",\"\",IF(MONTH(M29+1)<>MONTH(M29),\"\",M29+1))","v":"2019-10-11"},{"$f":"IF(N29=\"\",\"\",IF(MONTH(N29+1)<>MONTH(N29),\"\",N29+1))","v":"2019-10-12"},null,{"$f":"IF(W28=\"\",\"\",IF(MONTH(W28+1)<>MONTH(W28),\"\",W28+1))","v":"2019-11-03"},{"$f":"IF(Q29=\"\",\"\",IF(MONTH(Q29+1)<>MONTH(Q29),\"\",Q29+1))","v":"2019-11-04"},{"$f":"IF(R29=\"\",\"\",IF(MONTH(R29+1)<>MONTH(R29),\"\",R29+1))","v":"2019-11-05"},{"$f":"IF(S29=\"\",\"\",IF(MONTH(S29+1)<>MONTH(S29),\"\",S29+1))","v":"2019-11-06"},{"$f":"IF(T29=\"\",\"\",IF(MONTH(T29+1)<>MONTH(T29),\"\",T29+1))","v":"2019-11-07"},{"$f":"IF(U29=\"\",\"\",IF(MONTH(U29+1)<>MONTH(U29),\"\",U29+1))","v":"2019-11-08"},{"$f":"IF(V29=\"\",\"\",IF(MONTH(V29+1)<>MONTH(V29),\"\",V29+1))","v":"2019-11-09"},null,{"$f":"IF(AE28=\"\",\"\",IF(MONTH(AE28+1)<>MONTH(AE28),\"\",AE28+1))","v":"2019-12-08"},{"$f":"IF(Y29=\"\",\"\",IF(MONTH(Y29+1)<>MONTH(Y29),\"\",Y29+1))","v":"2019-12-09"},{"$f":"IF(Z29=\"\",\"\",IF(MONTH(Z29+1)<>MONTH(Z29),\"\",Z29+1))","v":"2019-12-10"},{"$f":"IF(AA29=\"\",\"\",IF(MONTH(AA29+1)<>MONTH(AA29),\"\",AA29+1))","v":"2019-12-11"},{"$f":"IF(AB29=\"\",\"\",IF(MONTH(AB29+1)<>MONTH(AB29),\"\",AB29+1))","v":"2019-12-12"},{"$f":"IF(AC29=\"\",\"\",IF(MONTH(AC29+1)<>MONTH(AC29),\"\",AC29+1))","v":"2019-12-13"},{"$f":"IF(AD29=\"\",\"\",IF(MONTH(AD29+1)<>MONTH(AD29),\"\",AD29+1))","v":"2019-12-14"},null,null,6,{"$f":"+'Home Page'!F14","v":"Zippy"},null,"2019-05-21","2019-05-23","2019-03-16","2019-12-06"]
[{"$f":"IF(G29=\"\",\"\",IF(MONTH(G29+1)<>MONTH(G29),\"\",G29+1))","v":"2019-09-15"},{"$f":"IF(A30=\"\",\"\",IF(MONTH(A30+1)<>MONTH(A30),\"\",A30+1))","v":"2019-09-16"},"2019-09-17","2019-09-18","2019-09-19","2019-09-20","2019-09-21",null,{"$f":"IF(O29=\"\",\"\",IF(MONTH(O29+1)<>MONTH(O29),\"\",O29+1))","v":"2019-10-13"},{"$f":"IF(I30=\"\",\"\",IF(MONTH(I30+1)<>MONTH(I30),\"\",I30+1))","v":"2019-10-14"},"2019-10-15","2019-10-16","2019-10-17","2019-10-18","2019-10-19",null,{"$f":"IF(W29=\"\",\"\",IF(MONTH(W29+1)<>MONTH(W29),\"\",W29+1))","v":"2019-11-10"},{"$f":"IF(Q30=\"\",\"\",IF(MONTH(Q30+1)<>MONTH(Q30),\"\",Q30+1))","v":"2019-11-11"},"2019-11-12","2019-11-13","2019-11-14","2019-11-15","2019-11-16",null,{"$f":"IF(AE29=\"\",\"\",IF(MONTH(AE29+1)<>MONTH(AE29),\"\",AE29+1))","v":"2019-12-15"},{"$f":"IF(Y30=\"\",\"\",IF(MONTH(Y30+1)<>MONTH(Y30),\"\",Y30+1))","v":"2019-12-16"},"2019-12-17","2019-12-18","2019-12-19","2019-12-20","2019-12-21",null,null,7,{"$f":"+'Home Page'!F15","v":"Mathew"},null,"2019-05-28","2019-05-30","2019-03-17","2019-12-23"]
["2019-09-22","2019-09-23","2019-09-24","2019-09-25","2019-09-26","2019-09-27","2019-09-28",null,"2019-10-20","2019-10-21","2019-10-22","2019-10-23","2019-10-24","2019-10-25","2019-10-26",null,"2019-11-17","2019-11-18","2019-11-19","2019-11-20","2019-11-21","2019-11-22","2019-11-23",null,"2019-12-22","2019-12-23","2019-12-24","2019-12-25","2019-12-26","2019-12-27","2019-12-28",null,null,8,{"$f":"+'Home Page'!F16","v":"Sooty"},null,"2019-06-04","2019-06-06","2019-03-23",{"$f":"+AN30+1","v":"2019-12-24"}]
["2019-09-29","2019-09-30","","","","","",null,"2019-10-27","2019-10-28","2019-10-29","2019-10-30","2019-10-31","","",null,"2019-11-24","2019-11-25","2019-11-26","2019-11-27","2019-11-28","2019-11-29","2019-11-30",null,"2019-12-29","2019-12-30","2019-12-31","","","","",null,null,9,{"$f":"+'Home Page'!F17","v":"Sweep"},null,"2019-06-11","2019-06-13","2019-03-24",{"$f":"+AN31+1","v":"2019-12-25"}]
["","","","","","","",null,"","","","","","","","[42]","","","","","","","",null,"","","","","","","",null,null,10,{"$f":"+'Home Page'!F18","v":"Sue"},null,"2019-06-18","2019-06-20","2019-03-30","2019-12-26"]
[null,null,null,null,null,null,null,null,null,null,null,null,null,null,null,null,null,null,null,null,null,null,null,null,null,null,null,null,null,null,null,null,null,null,null,null,"2019-06-25","2019-06-27","2019-03-31","2019-12-27"]
[null,null,null,null,null,null,null,null,null,null,null,null,null,null,null,null,null,null,null,null,null,null,null,null,null,null,null,null,null,null,null,null,null,null,null,null,"2019-07-02","2019-07-04","2019-04-06","2019-12-28"]
["Profesor",null,null,null,null,null,null,null,null,null,null,null,"HORARIO",null,null,null,null,null,null,null,null,null,null,null,null,null,null,null,null,null,null,null,null,null,null,null,"2019-07-09","2019-07-11","2019-04-07","2019-12-29"]
[null,null,null,null,null,null,null,null,null,null,null,null,null,null,null,null,null,null,null,null,null,null,null,null,null,null,null,null,null,null,null,null,null,null,null,null,"2019-07-16","2019-07-18","2019-04-13","2019-12-30"]
[{"$f":"+AI21","v":"Chris"},null,null,null,null,null,null,null,null,null,null,null,null,null,null,null,null,null,null,null,null,null,null,null,null,null,null,null,null,null,null,null,null,null,null,null,"2019-07-23","2019-07-25","2019-04-14","2019-12-31"]
[null,null,null,null,null,null,null,null,null,null,null,null,null,{"$f":"+AI12","v":"Martes"},null,null,null,{"$f":"+AI14","v":"Jueves"},null,null,null,null,null,null,"Vacaciones y fiestas",null,null,null,null,null,null,null,null,null,null,null,"2019-07-30","2019-08-01","2019-04-20",{"$f":"+AN24+1","v":"2019-08-01"}]
["Estudiantes",null,null,null,null,null,null,null,null,null,null,null,null,null,null,null,null,null,null,null,null,null,null,null,null,null,null,null,null,null,null,null,null,null,null,null,"2019-08-06","2019-08-08","2019-04-21",{"$f":"+AN39+1","v":"2019-08-02"}]
[null,null,null,null,null,null,null,null,null,null,null,null,"Fecha inicio",null,null,null,null,{"$f":"+AI8","v":"2019-01-08"},null,null,null,null,null,"Incicio",null,null,null,null,{"$f":"+AI17","v":"16:30:00"},null,null,null,null,null,null,null,"2019-08-13","2019-08-15","2019-04-27","2019-08-03"]
[1,{"$f":"+AI24","v":"Rod"},null,null,null,null,null,null,null,null,null,null,null,null,null,null,null,null,null,null,null,null,null,null,null,null,null,null,null,null,null,null,null,null,null,null,"2019-08-20","2019-08-22","2019-04-28","2019-08-04"]
[2,"Jane",null,null,null,null,null,null,null,null,null,null,"Fecha fin",null,null,null,null,{"$f":"+AI9","v":"2019-12-19"},null,null,null,null,null,"Fin",null,null,null,null,{"$f":"+AI18","v":"18:30:00"},null,null,null,null,null,null,null,{"$f":"IF(AK42=\"\",\"\",IF(AK42+7<=AI$9,AK42+7,\"\"))","v":"2019-08-27"},{"$f":"IF(AL42=\"\",\"\",IF(AL42+7<=AL$8,AL42+7,\"\"))","v":"2019-08-29"},{"$f":"+AM41+7","v":"2019-05-04"},"2019-08-05"]
[3,"Freddy",null,null,null,null,null,null,null,null,null,null,null,null,null,null,null,null,null,null,null,null,null,null,null,null,null,null,null,null,null,null,null,null,null,null,"2019-09-03","2019-09-05","2019-05-05","2019-08-06"]
[4,"George",null,null,null,null,null,null,null,null,null,null,null,null,null,null,null,null,null,null,null,null,null,"Class",null,null,null,null,{"$f":"+SUM(AC43-AC41)*24","v":2.0000000000000009},null,"hr",null,null,null,null,null,"2019-09-10","2019-09-12","2019-05-11","2019-08-07"]
[5,"Bungle",null,null,null,null,null,null,null,null,null,null,null,null,null,null,null,null,null,null,null,null,null,null,null,null,null,null,null,null,null,null,null,null,null,null,"2019-09-17","2019-09-19","2019-05-12","2019-08-08"]
[6,"Zippy",null,null,null,null,null,null,null,null,null,null,"Total  días",null,null,null,null,{"$f":"+AH12+AH14","v":102},null,null,null,null,null,"Total horas",null,null,null,null,{"$f":"+R47*AC45","v":204.00000000000009},null,null,null,null,null,null,null,"2019-09-24","2019-09-26","2019-05-18","2019-08-09"]
[7,"Mathew",null,null,null,null,null,null,null,null,null,null,null,null,null,null,null,null,null,null,null,null,null,null,null,null,null,null,null,null,null,null,null,null,null,null,"2019-10-01","2019-10-03","2019-05-19","2019-08-10"]
[8,"Sooty",null,null,null,null,null,null,null,null,null,null,null,null,null,null,null,null,null,null,null,null,null,null,null,null,null,null,null,null,null,null,null,null,null,null,"2019-10-08","2019-10-10","2019-05-25","2019-08-11"]
[9,{"$f":"+AI32","v":"Sweep"},null,null,null,null,null,null,null,null,null,null,null,null,null,null,null,null,null,null,null,null,null,null,null,null,null,null,null,null,null,null,null,null,null,null,"2019-10-15","2019-10-17","2019-05-26","2019-08-12"]
[10,"Sue",null,null,null,null,null,null,null,null,null,null,null,null,null,null,null,null,null,null,null,null,null,null,null,null,null,null,null,null,null,null,null,null,null,null,"2019-10-22","2019-10-24","2019-06-01","2019-08-13"]
[null,null,null,null,null,null,null,null,null,null,null,null,null,null,null,null,null,null,null,null,null,null,null,null,null,null,null,null,null,null,null,null,null,null,null,null,"2019-10-29","2019-10-31","2019-06-02","2019-08-14"]
[null,null,null,null,null,null,null,null,null,null,null,null,null,"Tarif",null,null,null,{"$f":"+AI4","v":0},null,null,null,null,null,"Total Cost",null,null,null,{"$f":"+AC47*R53","v":0},null,null,null,null,null,null,null,null,"2019-11-05","2019-11-07","2019-06-08","2019-08-15"]
[null,null,null,null,null,null,null,null,null,null,null,null,null,null,null,null,null,null,null,null,null,null,null,null,null,null,null,null,null,null,null,null,null,null,null,null,"2019-11-12","2019-11-14","2019-06-09","2019-08-16"]
[null,null,null,null,null,null,null,null,null,null,null,null,null,null,null,null,null,null,null,null,null,null,null,null,null,null,null,null,null,null,null,null,null,null,null,null,"2019-11-19","2019-11-21","2019-06-15","2019-08-17"]
[null,null,null,null,null,null,null,null,null,null,null,null,null,null,null,null,null,null,null,null,null,null,null,null,null,null,null,null,null,null,null,null,null,null,null,null,"2019-11-26","2019-11-28","2019-06-16","2019-08-18"]
[null,null,null,null,null,null,null,null,null,null,null,null,null,null,null,null,null,null,null,null,null,null,null,null,null,null,null,null,null,null,null,null,null,null,null,null,"2019-12-03","2019-12-05","2019-06-22","2019-08-19"]
[null,null,null,null,null,null,null,null,null,null,null,null,null,null,null,null,null,null,null,null,null,null,null,null,null,null,null,null,null,null,null,null,null,null,null,null,"2019-12-10","2019-12-12","2019-06-23","2019-08-20"]
[null,null,null,null,null,null,null,null,null,null,null,null,null,null,null,null,null,null,null,null,null,null,null,null,null,null,null,null,null,null,null,null,null,null,null,null,"2019-12-17","2019-12-19","2019-06-29","2019-08-21"]
[null,null,null,null,null,null,null,null,null,null,null,null,null,null,null,null,null,null,null,null,null,null,null,null,null,null,null,null,null,null,null,null,null,null,null,null,null,null,"2019-06-30","2019-08-22"]
[null,null,null,null,null,null,null,null,null,null,null,null,null,null,null,null,null,null,null,null,null,null,null,null,null,null,null,null,null,null,null,null,null,null,null,null,null,null,"2019-07-06","2019-08-23"]
[null,null,null,null,null,null,null,null,null,null,null,null,null,null,null,null,null,null,null,null,null,null,null,null,null,null,null,null,null,null,null,null,null,null,null,null,null,null,"2019-07-07","2019-08-24"]
[null,null,null,null,null,null,null,null,null,null,null,null,null,null,null,null,null,null,null,null,null,null,null,null,null,null,null,null,null,null,null,null,null,null,null,null,null,null,"2019-07-13","2019-08-25"]
[null,null,null,null,null,null,null,null,null,null,null,null,null,null,null,null,null,null,null,null,null,null,null,null,null,null,null,null,null,null,null,null,null,null,null,null,null,null,"2019-07-14","2019-08-26"]
[null,null,null,null,null,null,null,null,null,null,null,null,null,null,null,null,null,null,null,null,null,null,null,null,null,null,null,null,null,null,null,null,null,null,null,null,null,null,"2019-07-20","2019-08-27"]
[null,null,null,null,null,null,null,null,null,null,null,null,null,null,null,null,null,null,null,null,null,null,null,null,null,null,null,null,null,null,null,null,null,null,null,null,null,null,"2019-07-21","2019-08-28"]
[null,null,null,null,null,null,null,null,null,null,null,null,null,null,null,null,null,null,null,null,null,null,null,null,null,null,null,null,null,null,null,null,null,null,null,null,null,null,"2019-07-27","2019-08-29"]
[null,null,null,null,null,null,null,null,null,null,null,null,null,null,null,null,null,null,null,null,null,null,null,null,null,null,null,null,null,null,null,null,null,null,null,null,null,null,"2019-07-28","2019-08-30"]
[null,null,null,null,null,null,null,null,null,null,null,null,null,null,null,null,null,null,null,null,null,null,null,null,null,null,null,null,null,null,null,null,null,null,null,null,null,null,"2019-08-03","2019-08-31"]
[null,null,null,null,null,null,null,null,null,null,null,null,null,null,null,null,null,null,null,null,null,null,null,null,null,null,null,null,null,null,null,null,null,null,null,null,null,null,{"$f":"+AM68+7","v":"2019-08-04"}]
[null,null,null,null,null,null,null,null,null,null,null,null,null,null,null,null,null,null,null,null,null,null,null,null,null,null,null,null,null,null,null,null,null,null,null,null,{"$f":"IF(AK59=\"\",\"\",IF(AK59+7<=AI$9,AK59+7,\"\"))","v":""},{"$f":"IF(AL59=\"\",\"\",IF(AL59+7<=AL$8,AL59+7,\"\"))","v":""},"2019-08-10"]
[null,null,null,null,null,null,null,null,null,null,null,null,null,null,null,null,null,null,null,null,null,null,null,null,null,null,null,null,null,null,null,null,null,null,null,null,{"$f":"IF(AK71=\"\",\"\",IF(AK71+7<=AI$9,AK71+7,\"\"))","v":""},{"$f":"IF(AL71=\"\",\"\",IF(AL71+7<=AL$8,AL71+7,\"\"))","v":""},{"$f":"+AM70+7","v":"2019-08-11"}]
[null,null,null,null,null,null,null,null,null,null,null,null,null,null,null,null,null,null,null,null,null,null,null,null,null,null,null,null,null,null,null,null,null,null,null,null,"","","2019-08-17"]
[null,null,null,null,null,null,null,null,null,null,null,null,null,null,null,null,null,null,null,null,null,null,null,null,null,null,null,null,null,null,null,null,null,null,null,null,"","","2019-08-18"]
[null,null,null,null,null,null,null,null,null,null,null,null,null,null,null,null,null,null,null,null,null,null,null,null,null,null,null,null,null,null,null,null,null,null,null,null,"","",{"$f":"+AM73+7","v":"2019-08-24"}]
[null,null,null,null,null,null,null,null,null,null,null,null,null,null,null,null,null,null,null,null,null,null,null,null,null,null,null,null,null,null,null,null,null,null,null,null,"","","2019-08-25"]
[null,null,null,null,null,null,null,null,null,null,null,null,null,null,null,null,null,null,null,null,null,null,null,null,null,null,null,null,null,null,null,null,null,null,null,null,"","","2019-08-31"]
[null,null,null,null,null,null,null,null,null,null,null,null,null,null,null,null,null,null,null,null,null,null,null,null,null,null,null,null,null,null,null,null,null,null,null,null,"","","2019-09-01"]
[null,null,null,null,null,null,null,null,null,null,null,null,null,null,null,null,null,null,null,null,null,null,null,null,null,null,null,null,null,null,null,null,null,null,null,null,"","","2019-09-07"]
[null,null,null,null,null,null,null,null,null,null,null,null,null,null,null,null,null,null,null,null,null,null,null,null,null,null,null,null,null,null,null,null,null,null,null,null,"","","2019-09-08"]
[null,null,null,null,null,null,null,null,null,null,null,null,null,null,null,null,null,null,null,null,null,null,null,null,null,null,null,null,null,null,null,null,null,null,null,null,null,null,"2019-09-14"]
[null,null,null,null,null,null,null,null,null,null,null,null,null,null,null,null,null,null,null,null,null,null,null,null,null,null,null,null,null,null,null,null,null,null,null,null,null,null,"2019-09-15"]
[null,null,null,null,null,null,null,null,null,null,null,null,null,null,null,null,null,null,null,null,null,null,null,null,null,null,null,null,null,null,null,null,null,null,null,null,null,null,"2019-09-21"]
[null,null,null,null,null,null,null,null,null,null,null,null,null,null,null,null,null,null,null,null,null,null,null,null,null,null,null,null,null,null,null,null,null,null,null,null,null,null,"2019-09-22"]
[null,null,null,null,null,null,null,null,null,null,null,null,null,null,null,null,null,null,null,null,null,null,null,null,null,null,null,null,null,null,null,null,null,null,null,null,null,null,"2019-09-28"]
[null,null,null,null,null,null,null,null,null,null,null,null,null,null,null,null,null,null,null,null,null,null,null,null,null,null,null,null,null,null,null,null,null,null,null,null,null,null,"2019-09-29"]
[null,null,null,null,null,null,null,null,null,null,null,null,null,null,null,null,null,null,null,null,null,null,null,null,null,null,null,null,null,null,null,null,null,null,null,null,null,null,"2019-10-05"]
[null,null,null,null,null,null,null,null,null,null,null,null,null,null,null,null,null,null,null,null,null,null,null,null,null,null,null,null,null,null,null,null,null,null,null,null,null,null,"2019-10-06"]
[null,null,null,null,null,null,null,null,null,null,null,null,null,null,null,null,null,null,null,null,null,null,null,null,null,null,null,null,null,null,null,null,null,null,null,null,null,null,"2019-10-12"]
[null,null,null,null,null,null,null,null,null,null,null,null,null,null,null,null,null,null,null,null,null,null,null,null,null,null,null,null,null,null,null,null,null,null,null,null,null,null,"2019-10-13"]
[null,null,null,null,null,null,null,null,null,null,null,null,null,null,null,null,null,null,null,null,null,null,null,null,null,null,null,null,null,null,null,null,null,null,null,null,null,null,"2019-10-19"]
[null,null,null,null,null,null,null,null,null,null,null,null,null,null,null,null,null,null,null,null,null,null,null,null,null,null,null,null,null,null,null,null,null,null,null,null,null,null,"2019-10-20"]
[null,null,null,null,null,null,null,null,null,null,null,null,null,null,null,null,null,null,null,null,null,null,null,null,null,null,null,null,null,null,null,null,null,null,null,null,null,null,"2019-10-26"]
[null,null,null,null,null,null,null,null,null,null,null,null,null,null,null,null,null,null,null,null,null,null,null,null,null,null,null,null,null,null,null,null,null,null,null,null,null,null,"2019-10-27"]
[null,null,null,null,null,null,null,null,null,null,null,null,null,null,null,null,null,null,null,null,null,null,null,null,null,null,null,null,null,null,null,null,null,null,null,null,null,null,"2019-11-02"]
[null,null,null,null,null,null,null,null,null,null,null,null,null,null,null,null,null,null,null,null,null,null,null,null,null,null,null,null,null,null,null,null,null,null,null,null,null,null,"2019-11-03"]
[null,null,null,null,null,null,null,null,null,null,null,null,null,null,null,null,null,null,null,null,null,null,null,null,null,null,null,null,null,null,null,null,null,null,null,null,null,null,"2019-11-09"]
[null,null,null,null,null,null,null,null,null,null,null,null,null,null,null,null,null,null,null,null,null,null,null,null,null,null,null,null,null,null,null,null,null,null,null,null,null,null,"2019-11-10"]
[null,null,null,null,null,null,null,null,null,null,null,null,null,null,null,null,null,null,null,null,null,null,null,null,null,null,null,null,null,null,null,null,null,null,null,null,null,null,"2019-11-16"]
[null,null,null,null,null,null,null,null,null,null,null,null,null,null,null,null,null,null,null,null,null,null,null,null,null,null,null,null,null,null,null,null,null,null,null,null,null,null,"2019-11-17"]
[null,null,null,null,null,null,null,null,null,null,null,null,null,null,null,null,null,null,null,null,null,null,null,null,null,null,null,null,null,null,null,null,null,null,null,null,null,null,"2019-11-23"]
[null,null,null,null,null,null,null,null,null,null,null,null,null,null,null,null,null,null,null,null,null,null,null,null,null,null,null,null,null,null,null,null,null,null,null,null,null,null,"2019-11-24"]
[null,null,null,null,null,null,null,null,null,null,null,null,null,null,null,null,null,null,null,null,null,null,null,null,null,null,null,null,null,null,null,null,null,null,null,null,null,null,"2019-11-30"]
[null,null,null,null,null,null,null,null,null,null,null,null,null,null,null,null,null,null,null,null,null,null,null,null,null,null,null,null,null,null,null,null,null,null,null,null,null,null,"2019-12-01"]
[null,null,null,null,null,null,null,null,null,null,null,null,null,null,null,null,null,null,null,null,null,null,null,null,null,null,null,null,null,null,null,null,null,null,null,null,null,null,"2019-12-07"]
[null,null,null,null,null,null,null,null,null,null,null,null,null,null,null,null,null,null,null,null,null,null,null,null,null,null,null,null,null,null,null,null,null,null,null,null,null,null,"2019-12-08"]
[null,null,null,null,null,null,null,null,null,null,null,null,null,null,null,null,null,null,null,null,null,null,null,null,null,null,null,null,null,null,null,null,null,null,null,null,null,null,{"$f":"+AM105+7","v":"2019-12-14"}]
[null,null,null,null,null,null,null,null,null,null,null,null,null,null,null,null,null,null,null,null,null,null,null,null,null,null,null,null,null,null,null,null,null,null,null,null,null,null,"2019-12-15"]
[null,null,null,null,null,null,null,null,null,null,null,null,null,null,null,null,null,null,null,null,null,null,null,null,null,null,null,null,null,null,null,null,null,null,null,null,null,null,"2019-12-21"]
[null,null,null,null,null,null,null,null,null,null,null,null,null,null,null,null,null,null,null,null,null,null,null,null,null,null,null,null,null,null,null,null,null,null,null,null,null,null,"2019-12-22"]
[null,null,null,null,null,null,null,null,null,null,null,null,null,null,null,null,null,null,null,null,null,null,null,null,null,null,null,null,null,null,null,null,null,null,null,null,null,null,"2019-12-28"]
[null,null,null,null,null,null,null,null,null,null,null,null,null,null,null,null,null,null,null,null,null,null,null,null,null,null,null,null,null,null,null,null,null,null,null,null,null,null,"2019-12-29"]

{"sheet":"Sheet2","index":35,"n_rows":0,"n_cols":0,"rows_kept":0,"cut":false,"hidden":true,"merged":[]}